Environmental Research Infrastructure
type: ConceptScheme
definition: Environmental Research Infrastructures provide high-quality, open and FAIR data and services to study the different components of the Earth system within four domains including the atmosphere, marine, ecosystem and solid Earth.
modified: 2025-07-21T13:49:18
created: 2024-12-10T10:31:26
source: https://envri.eu/research-infrastructures/

Research Infrastructure
type: Concept
definition: A Research Infrastructure is a facility that provides resources and services for the research communities to conduct research and foster innovation, including the associated human resources and expertise; major equipment or sets of instruments; knowledge-related facilities such as collections, archives and/or scientific data infrastructures; computing systems, communication networks; and any other infrastructure of a unique nature and open to different Users, essential to achieve excellence in research and innovation. Where relevant, these resources may be used beyond research, for example for training and education or public services. They may be virtual, single-site or distributed.
in scheme: Environmental Research Infrastructure
alternative label: RI
broader: Actor
modified: 2025-07-15T14:42:02
created: 2024-12-10T11:35:14
source: https://eur-lex.europa.eu/eli/reg/2021/695/oj/eng

Actor
type: Concept
definition: An actor is an institution, an individual or a group of individuals that exercises action in the knowledge generation process, for which the actor is responsible.
in scheme: Environmental Research Infrastructure
top concept of: Environmental Research Infrastructure
modified: 2024-12-12T11:45:37
created: 2024-12-12T11:45:18

Terminology Service
type: Concept
definition: A terminology service provides a web service interface that serves as a generic access point to heterogeneous semantic artefacts. These semantic artefacts can be internally hosted or accessed via their remote web services. A TS can also enable mappings of both internal and external semantic artefacts into a common output format.
in scheme: Environmental Research Infrastructure
alternative label: TS
broader: e-Service
modified: 2025-06-06T11:46:48
created: 2024-12-10T13:03:56
source: https://doi.org/10.1007/s13222-016-0231-8

e-Service
type: Concept
definition: e-Service is an automated service that responds to requests via an information network by receiving inputs, manipulating them, and sending back appropriate outputs.
in scheme: Environmental Research Infrastructure
alternative label: Digital Service
alternative label: Electronic service
broader: Service
modified: 2025-06-06T15:30:47
created: 2025-02-24T14:43:26

Service
type: Concept
definition: A service refers to any support, tool, or functionality provided to facilitate scientific research activities. Services are integral to enabling researchers to effectively conduct their work by offering the necessary infrastructure, resources, and expertise.
in scheme: Environmental Research Infrastructure
top concept of: Environmental Research Infrastructure
modified: 2024-12-13T09:50:10
created: 2024-12-11T10:40:24
source: Gargano G, Cornacchia C, Palazzo Q, Saganeiti L (2024) ITINERIS Catalogue of resources. In Plenary Presentations of the 2nd ITINERIS General Meeting, Rome 2024. Available at: https://itineris.cnr.it/wp-content/uploads/2024/07/ITINERIS_2nd_annual_meeting_slides-1.pdf

Digital Object
type: Concept
definition: A Digital Object (DO) is a sequence of bits, or a set of sequences of bits, incorporating a work or portion of a work or other information in which a party has rights or interests, or in which there is value, each of the sequences being structured in a way that is interpretable by one or more of the computational facilities and having as an essential element an associated unique persistent identifier.
in scheme: Environmental Research Infrastructure
alternative label: DO
broader: Research product
modified: 2025-06-17T15:52:31
created: 2024-12-12T10:11:10
source: https://doi.org/10.1007/s00799-005-0128-x

Research product
type: Concept
definition: A research product is any research artifact—whether physical or digital—generated through a systematic, creative, and reproducible research process.
in scheme: Environmental Research Infrastructure
top concept of: Environmental Research Infrastructure
modified: 2025-06-18T11:38:42
created: 2025-06-17T15:27:46

ESFRI domain
type: Concept
definition: A scientific domain in which a Research Infrastructure contribute by supporting frontier research and by proving key data necessary to address the Grand Challenges. Each domain is structured, when needed, in subdomains of research.
in scheme: Environmental Research Infrastructure
top concept of: Environmental Research Infrastructure
alternative label: ESFRI Thematic Area
modified: 2025-06-18T11:04:36
created: 2024-12-12T11:06:11
source: https://roadmap2021.esfri.eu/landscape-analysis/

Best practice
type: Concept
definition: A procedure that has been shown by research and experience to produce optimal results and that is established or proposed as a standard suitable for widespread adoption.
in scheme: Environmental Research Infrastructure
broader: Project Management
modified: 2025-06-06T09:22:43
modified: 2025-06-06T09:22:57
created: 2024-12-12T11:08:03
source: https://csrc.nist.gov/glossary/term/best_practice

Project Management
type: Concept
definition: Project management involves planning, organizing and performing specific tasks, events, or duties toward their completion.
in scheme: Environmental Research Infrastructure
top concept of: Environmental Research Infrastructure
alternative label: PM
modified: 2025-06-19T11:11:45
created: 2025-06-05T16:49:44

FAIR principles
type: Concept
definition: Principles for scientific data management and stewardship intended to provide guidelines to improve the findability, accessibility, interoperability, and reuse of digital assets.
in scheme: Environmental Research Infrastructure
broader: Best practice
modified: 2025-01-10T15:03:57
created: 2024-12-18T11:40:01

Findable
type: Concept
definition: Digital objects are easily discoverable by both humans and machines by using machine-readable metadata.
in scheme: Environmental Research Infrastructure
alternative label: Findability
broader: FAIR principles
modified: 2025-06-05T15:52:04
created: 2025-01-02T09:55:41

Accessible
type: Concept
definition: The quality of being able to reach and access digital objects through authentication and authorisation protocols.
in scheme: Environmental Research Infrastructure
alternative label: Accessibility
broader: FAIR principles
modified: 2025-06-05T15:52:10
created: 2025-01-02T09:55:49

Interoperable
type: Concept
definition: The ability of computer systems or software to exchange and make use of digital objects by using standardized languages and vocabularies.
in scheme: Environmental Research Infrastructure
alternative label: Interoperability
broader: FAIR principles
modified: 2025-07-15T15:56:50
created: 2025-01-02T09:56:04

Reusable
type: Concept
definition: The quality of being able to replicate and/or combine digital objects in different settings.
in scheme: Environmental Research Infrastructure
alternative label: Reusability
broader: FAIR principles
modified: 2025-06-05T15:52:46
created: 2025-01-02T09:56:14

Semantic Interoperability
type: Concept
definition: The ability of computer systems to transmit data with unambiguous, shared meaning. Semantic interoperability is a requirement to enable machine computable logic, inferencing, knowledge discovery, and data federation between information systems.
in scheme: Environmental Research Infrastructure
alternative label: SI
broader: Interoperable
modified: 2025-07-15T15:57:31
created: 2025-01-02T10:23:59
source: https://data.europa.eu/doi/10.2777/620649

Syntactic Interoperability
type: Concept
definition: Syntactic interoberability ensures that the precise format and meaning of exchanged data and information is preserved and understood throughout exchanges between parties.
in scheme: Environmental Research Infrastructure
broader: Interoperable
modified: 2025-07-15T15:57:50
created: 2025-01-02T10:24:18
source: https://data.europa.eu/doi/10.2777/620649

FAIR Digital Object
type: Concept
definition: A FAIR digital object is a unit composed of data that is a sequence of bits, or a set of sequences of bits, each of the sequences being structured (typed) in a way that is interpretable by one or more computer systems, and having as essential elements an assigned globally unique and persistent identifier (PID), a type definition for the object as a whole and a metadata description (which itself can be another FAIR digital object) of the properties of the object, making the whole findable, accessible, interoperable and reusable both by humans and computers for the reliable interpretation and processing of the data represented by the object.
in scheme: Environmental Research Infrastructure
alternative label: FDO
broader: Digital Object
modified: 2025-07-15T14:06:51
created: 2025-01-07T10:05:40

FAIR assessment
type: Concept
definition: Refers to the use of questions/tests to assess to which degree a digital object is compliant with a FAIR sub-principle or, by generalisation, a principle.
in scheme: Environmental Research Infrastructure
broader: Research product management
modified: 2025-01-24T13:50:47
created: 2025-01-07T10:21:38
source: https://dx.doi.org/10.1504/IJMSO.2022.131133

Research product management
type: Concept
definition: Storage, access and preservation of data created or collected in the course of research. Data management practices cover the entire lifecycle of the data, from planning the investigation to conducting it, and from backing up data as it is created and used to long term preservation of data deliverables after the research investigation has concluded. Specific activities and issues that fall within the category of data management include: File naming (the proper way to name computer files); data quality control and quality assurance; data access; data documentation (including levels of uncertainty); metadata creation and controlled vocabularies; data storage; data archiving and preservation; data sharing and reuse; data integrity; data security; data privacy; data rights; notebook protocols (lab or field) as required.
in scheme: Environmental Research Infrastructure
alternative label: Research data management
alternative label: RDA
broader: Project Management
modified: 2025-06-06T09:45:04
created: 2025-01-07T11:01:08

License
type: Concept
definition: A legal document giving official permission to do something with the resource.
in scheme: Environmental Research Infrastructure
alternative label: Licence
broader: FAIR-Enabling Resource
narrow match: Data-usage-license
modified: 2025-07-08T10:21:54
modified: 2025-07-15T12:06:14
created: 2025-01-07T10:49:07

FAIR-Enabling Resource
type: Concept
definition: A service, a specification or a data policy that is essential to the operationalization of the FAIR Principles, i.e., puts FAIR into action. A FAIR-Enabling Resource (FER) provides a function needed to achieve some aspect of FAIR behavior and is explicitly linked to one or more FAIR principles.
in scheme: Environmental Research Infrastructure
alternative label: FER
broader: Best practice
modified: 2025-01-10T14:07:00
created: 2025-01-08T09:19:09

Risk analysis
type: Concept
definition: Process to comprehend the nature of risk (intended as effect of uncertainty on objectives) and to determine the level of risk.
in scheme: Environmental Research Infrastructure
broader: Best practice
modified: 2025-01-07T10:57:24
created: 2025-01-07T10:54:18
source: https://www.iso.org/obp/ui/#iso:std:iso:guide:73:ed-1:v1:en

Data Management Plan
type: Concept
definition: Statement describing how research data will be managed throughout a specified research project's life cycle - during and after the active phase of the research project - including terms regarding archiving and potential preservation of the data in a data repository. The DMP is considered to be a 'living' document, i.e. one which can be updated when necessary.
in scheme: Environmental Research Infrastructure
alternative label: DMP
broader: Research product management
broader: FAIR-Enabling Resource
modified: 2025-01-15T09:32:54
created: 2025-01-07T12:19:01

Metadata longevity plan
type: Concept
definition: A metadata longevity plan ensures that metadata are accessible even when the data are no longer available.
in scheme: Environmental Research Infrastructure
broader: Research product management
broader: FAIR-Enabling Resource
modified: 2025-07-15T15:58:32
created: 2025-01-07T12:19:20

Quality assessment
type: Concept
definition: Assessment of details of the data generation, including the check of the plausibility of the data. Usually the quality assessment is done by predefined checks on data and their generation process.
in scheme: Environmental Research Infrastructure
broader: Research product management
modified: 2025-07-15T15:59:02
created: 2025-01-07T12:39:26
source: https://doi.org/10.5281/zenodo.3465752

Quality Assurance
type: Concept
definition: The process or set of processes used to measure and assure the quality of a product.
in scheme: Environmental Research Infrastructure
alternative label: QA
broader: Research product management
modified: 2025-01-15T09:33:32
created: 2025-01-07T12:39:39

Quality Control
type: Concept
definition: The efforts and processes put in place to ensure that the management of research data is of sufficient quality to allow researchers to carry out their work effectively.
in scheme: Environmental Research Infrastructure
alternative label: QC
broader: Research product management
modified: 2025-01-15T09:33:44
created: 2025-01-07T12:39:51

FAIR Implementation Profile
type: Concept
definition: A FAIR Implementation Profile (FIP) is a list of declared technology choices intended to implement each of the FAIR Guiding Principles, made as a collective decision by the members of a particular community of practice.
in scheme: Environmental Research Infrastructure
alternative label: FIP
broader: FAIR-Enabling Resource
modified: 2025-01-08T09:22:05
created: 2025-01-08T09:20:18

PID
type: Concept
definition: Long-lasting digital reference to an object that gives information about that object regardless of what happens to that object. Developed to address link rot, a persistent identifier can be resolved to provide an appropriate representation of an object whether that object changes its online location or goes offline.
in scheme: Environmental Research Infrastructure
alternative label: Persistent identifier
broader: URI
modified: 2025-03-27T09:49:40
created: 2025-01-08T09:20:29

URI
type: Concept
definition: URI (Uniform Resource Identifier) is defined as a sequence of characters that serves to uniquely identify a specific resource within the Internet or a computer system. Its purpose is to provide a standard means of referring to digital resources, regardless of their location or method of access. URI is based on the ASCII code (American Standard Code for Information Interchange), a character encoding standard for electronic communications.
in scheme: Environmental Research Infrastructure
alternative label: Uniform Resource Identifier
broader: IRI
modified: 2025-03-27T12:04:23
created: 2025-01-08T09:43:43

IRI
type: Concept
definition: IRI (Internationalized Resource Identifier) is an internet protocol standard that builds on the Uniform Resource Identifier (URI) protocol. It greatly expands the set of permitted characters, utilising the Universal Character Set, a standard set of characters defined by the international standard ISO/IEC 10646.
in scheme: Environmental Research Infrastructure
alternative label: Internationalized Resource Identifier
broader: FAIR-Enabling Resource
modified: 2025-03-27T12:03:35
created: 2025-01-08T09:29:29

DOI
type: Concept
definition: Type of digital Persistent Identifier (PID) issued by the International DOI Foundation. This permanent digital identifier is associated with an object that permits the object to be referenced reliably even if its location and metadata undergo change over time.
in scheme: Environmental Research Infrastructure
alternative label: Digital Object Identifier
broader: PID
modified: 2025-03-27T09:50:17
created: 2025-01-08T09:29:23

ORCID ID
type: Concept
definition: Unique identifier for researchers. Disambiguates researchers and allows researchers to connect their ID with additional professional information including affiliations, grants, and publications.
in scheme: Environmental Research Infrastructure
alternative label: Oper Researcher and Contributor ID
broader: PID
modified: 2025-06-17T11:49:05
created: 2025-01-08T09:29:39

ROR ID
type: Concept
definition: Perennial identifier assigned to a research organisation.
in scheme: Environmental Research Infrastructure
alternative label: Research Orzanization Registry identifier
alternative label: ROR identifier
broader: PID
modified: 2025-03-27T09:50:27
created: 2025-01-08T09:43:38

PURL
type: Concept
definition: URL that points to an intermediate resolution service. The PURL resolution service associates the PURL with the actual URL and returns that URL to the client.
in scheme: Environmental Research Infrastructure
alternative label: Persistent Uniform Resource Locator
broader: URI
modified: 2025-03-27T12:12:04
created: 2025-01-08T10:24:24

Open Science
type: Concept
definition: Scientific knowledge that is openly available, accessible and reusable for everyone, to increase scientific collaborations and sharing of information for the benefits of science and society, and to open the processes of scientific knowledge creation, evaluation and communication to societal actors beyond the traditional scientific community.
in scheme: Environmental Research Infrastructure
alternative label: OS
broader: Best practice
modified: 2025-01-10T13:59:26
created: 2025-01-08T10:39:11

Governance
type: Concept
definition: Exercising authority to provide direction and to undertake, coordinate, and regulate activities in support of achieving this direction and desired outcomes. Governance can be thought of as the role of an organization's board of directors or its equivalent that is focused on defining that organization's purpose and the development of the strategies, objectives, values, and policies that frame how that purpose will be pursued. It includes the development of such things as mission statements, statements of organizational objectives and values, logic models, organizational performance metrics, risk management frameworks, policies and guidelines for financial and operational matters, stakeholder relations, etc.
in scheme: Environmental Research Infrastructure
broader: Project Management
modified: 2025-06-06T09:33:51
created: 2025-01-08T11:40:40

Board of Partner Financial Officers
type: Concept
definition: A group of Financial Officers that handle the administrative and financial matters for all the partners. The group is lead by the project Financial Officer and assure smooth handling of the project for the financial and administrative aspects, supervising the work done at OU level for each partner.
in scheme: Environmental Research Infrastructure
alternative label: FOB
broader: Governance
modified: 2025-01-08T12:11:07
created: 2025-01-08T12:03:37

Coordination Committee
type: Concept
definition: The Coordination Committee is composed by the Principal Investigators (PIs) of all project partners which have the decision role.
in scheme: Environmental Research Infrastructure
alternative label: CC
broader: Governance
modified: 2025-01-08T12:11:51
created: 2025-01-08T12:03:56

Executive Board
type: Concept
definition: The Executive Board oversees activities related to strategic planning and decision-making. The Executive Board provides strategic oversight to an organisation, a project or a Research Infrastructure and often divides itself into several committees or sub-boards to divide duties based on expertise.
example: The EB can be formed by the WP leaders and other experts as in the case of the ITINERIS project.
in scheme: Environmental Research Infrastructure
alternative label: EB
broader: Governance
modified: 2025-01-08T12:13:45
created: 2025-01-08T12:05:11
source: https://www.onboardmeetings.com/blog/executive-board/

External Strategic Advisory Committee
type: Concept
definition: A group of international experts that carry out regular external assessment of a project development, performance, implementation, operation, and that provide strategic advises.
in scheme: Environmental Research Infrastructure
alternative label: ESAC
broader: Governance
modified: 2025-01-08T12:14:43
created: 2025-01-08T12:05:42

FAIR Implementation Working Group
type: Concept
definition: A FAIR Implementation Working Group is a Working Group with the aim to implement the FAIR Principles within a project. The Working Group consist of personnel with expertise on FAIR Principles and on their application. The role of this Working Group is to identify current understanding and adoption of the FAIR Principles and to provide recommendations and technical requirements for their implementation within the project.
in scheme: Environmental Research Infrastructure
alternative label: FIWG
broader: Governance
modified: 2025-01-08T12:16:25
created: 2025-01-08T12:06:03

Reference User Group
type: Concept
definition: A group composed by representatives of users/stakeholders with the role to represent the user needs and expectations.
in scheme: Environmental Research Infrastructure
alternative label: RUG
broader: Governance
modified: 2025-01-08T12:17:01
created: 2025-01-08T12:06:25

Research Infastructure Board
type: Concept
definition: A group composed by the representatives of the Research Infrastructures.
in scheme: Environmental Research Infrastructure
alternative label: Research infrastructure board
alternative label: RIB
broader: Governance
modified: 2025-01-08T12:17:47
created: 2025-01-08T12:06:43

Partner
type: Concept
definition: A partner is an individual, organization, or entity that actively collaborates in a research project.
in scheme: Environmental Research Infrastructure
broader: Actor
modified: 2025-01-09T09:59:51
created: 2025-01-08T12:19:55

Operative Unit
type: Concept
definition: A unit which is part of some larger Organization and has full recognition within the context of that Organization. It can represents, for instance, the different departments of a university that participate in a particular project.
in scheme: Environmental Research Infrastructure
alternative label: OU
broader: Actor
modified: 2025-06-19T11:42:48
created: 2025-01-08T12:20:04

Work Package
type: Concept
definition: A component of the case for support of a grant application, describing a particular aspect of the work to be undertaken.
in scheme: Environmental Research Infrastructure
alternative label: WP
broader: Governance
modified: 2025-06-06T08:01:30
created: 2025-01-08T12:20:47

CNR
type: Concept
in scheme: Environmental Research Infrastructure
alternative label: National Research Council
alternative label: Consiglio Nazionale delle Ricerche @it
broader: ITINERIS Organisation
modified: 2025-07-15T15:42:18
created: 2025-01-09T09:27:02

ITINERIS Organisation
type: Concept
definition: Organisations involved within the ITINERIS project.
in scheme: Environmental Research Infrastructure
broader: Organisation
modified: 2025-06-10T09:58:21
created: 2025-06-10T09:56:58

Organisation
type: Concept
definition: A group of individuals that is formed ad-hoc or corresponds to an institution that normally has a legal status. It may belong to another organization, forming group hierarchies.
in scheme: Environmental Research Infrastructure
broader: Partner
modified: 2025-06-09T13:42:54
created: 2025-06-05T15:56:56

CNR-IAS
type: Concept
in scheme: Environmental Research Infrastructure
alternative label: Institute for the Study of Anthropic Impact and Sustainability in the Marine Environment
alternative label: Institute for the Study of Anthropic Impact and Sustainability in the Marine Environment of the National Research Council
alternative label: Istituto per lo studio degli impatti Antropici e Sostenibilità in ambiente marino @it
alternative label: National Research Council - Institute for the Study of Anthropic Impact and Sustainability in the Marine Environment
broader: ITINERIS Operative Unit
modified: 2025-07-15T15:40:05
created: 2025-01-09T09:33:23

ITINERIS Operative Unit
type: Concept
definition: Operative Unit involved in the ITINERIS project.
in scheme: Environmental Research Infrastructure
alternative label: ITINERIS OU
broader: Operative Unit
modified: 2025-06-20T08:59:56
created: 2025-01-09T10:25:33

CNR-IBBR
type: Concept
in scheme: Environmental Research Infrastructure
alternative label: Institute of Biosciences and Bioresources
alternative label: Istituto di Bioscienze e Biorisorse @it
alternative label: National Research Council - Institute of Biosciences and Bioresources
broader: ITINERIS Operative Unit
modified: 2025-07-15T15:39:09
created: 2025-01-09T09:34:49

CNR-IBE
type: Concept
in scheme: Environmental Research Infrastructure
alternative label: Istituto per la BioEconomia @it
alternative label: National Research Council - Institute for BioEconomy
broader: ITINERIS Operative Unit
modified: 2025-07-15T15:37:30
created: 2025-01-09T09:35:56

CNR-IGG
type: Concept
in scheme: Environmental Research Infrastructure
alternative label: Institute of Geosciences and Earth Resources
alternative label: Istituto di Geoscienze e Georisorse @it
alternative label: National Research Council - Institute of Geosciences and Earth Resources
broader: ITINERIS Operative Unit
modified: 2025-07-15T15:38:41
created: 2025-01-09T09:36:28

CNR-IMAA
type: Concept
in scheme: Environmental Research Infrastructure
alternative label: Consiglio Nazionale delle Ricerche - Istituto di Metodologie per l’Analisi Ambientale @it
alternative label: Institute of Methodologies for Environmental Analysis
alternative label: Istituto di Metodologie per l’Analisi Ambientale @it
alternative label: National Research Council - Institute of Methodologies for Environmental Analysis
broader: ITINERIS Operative Unit
modified: 2025-07-15T15:41:26
created: 2025-01-09T09:37:23

CNR-IPSP
type: Concept
in scheme: Environmental Research Infrastructure
alternative label: Institute for Sustainable Plant Protection
alternative label: Institute of Plant Virology
alternative label: Istituto per la Protezione Sostenibile delle Piante @it
alternative label: National Research Council - Institute for Sustainable Plant Protection
broader: ITINERIS Operative Unit
modified: 2025-07-15T15:36:48
created: 2025-01-09T09:40:01

CNR-IREA
type: Concept
in scheme: Environmental Research Infrastructure
alternative label: Istituto per il Rilevamento Elettromagnetico dell'Ambiente @it
alternative label: Institute for Electromagnetic Sensing of the Environment
alternative label: National Research Council - Institute for Electromagnetic Sensing of the Environment
broader: ITINERIS Operative Unit
modified: 2025-07-15T15:41:00
created: 2025-01-09T09:40:59

CNR-IRET
type: Concept
in scheme: Environmental Research Infrastructure
alternative label: Research Institute on Terrestrial Ecosystems
alternative label: Istituto di Ricerca sugli Ecosistemi Terrestri @it
alternative label: National Research Council - Research Institute on Terrestrial Ecosystems
broader: ITINERIS Operative Unit
narrower: CNR-IRETLE
modified: 2025-07-15T15:34:43
created: 2025-01-09T09:42:25
source: https://www.iret.cnr.it/

CNR-IRETLE
type: Concept
in scheme: Environmental Research Infrastructure
alternative label: Istituto di Ricerca sugli Ecosistemi Terrestri - URT Lecce @it
alternative label: National Research Council - Research Institute on Terrestrial Ecosystems Lecce
modified: 2025-07-15T15:39:54
created: 2025-01-09T10:37:32

CNR-IRSA
type: Concept
in scheme: Environmental Research Infrastructure
alternative label: Water Research Institute
alternative label: Istituto di Ricerca sulle Acque @it
alternative label: National Research Council - Water Research Institute
broader: ITINERIS Operative Unit
modified: 2025-07-15T15:39:37
created: 2025-01-09T09:43:29

CNR-ISAC
type: Concept
in scheme: Environmental Research Infrastructure
alternative label: Institute of Atmospheric Sciences and Climate
alternative label: Istituto di Scienze dell'Atmosfera e del Clima @it
alternative label: National Research Council - Institute of Atmospheric Sciences and Climate
broader: ITINERIS Operative Unit
modified: 2025-07-15T15:34:15
created: 2025-01-09T09:44:49

CNR-ISMAR
type: Concept
in scheme: Environmental Research Infrastructure
alternative label: Institute of Marine Science
alternative label: Istituto di Scienze Marine @it
alternative label: National Research Council - Institute of Marine Science
broader: ITINERIS Operative Unit
modified: 2025-07-15T15:41:55
created: 2025-01-09T09:46:03

CNR-ISP
type: Concept
in scheme: Environmental Research Infrastructure
alternative label: Institute of Polar Sciences
alternative label: Istituto di Scienze Polari @it
alternative label: National Research Council - Institute of Polar Sciences
broader: ITINERIS Operative Unit
modified: 2025-07-15T15:38:29
created: 2025-01-09T09:46:47

INFN
type: Concept
in scheme: Environmental Research Infrastructure
alternative label: National Institute for Nuclear Physics
alternative label: Istituto Nazionale di Fisica Nucleare @it
broader: ITINERIS Organisation
modified: 2025-07-15T15:35:34
created: 2025-01-09T09:52:38

INGV
type: Concept
in scheme: Environmental Research Infrastructure
alternative label: National Institute of Geophysics and Volcanology
alternative label: Istituto Nazionale di Geofisica e Vulcanologia @it
broader: ITINERIS Organisation
modified: 2025-07-15T15:31:59
created: 2025-01-09T10:04:40

ISPRA
type: Concept
in scheme: Environmental Research Infrastructure
alternative label: Institute for Environmental Protection and Research
alternative label: Istituto Superiore per la Protezione e la Ricerca Ambientale @it
broader: ITINERIS Organisation
broader: ITINERIS Operative Unit
modified: 2025-07-15T15:33:47
created: 2025-01-09T10:05:18

OGS
type: Concept
in scheme: Environmental Research Infrastructure
alternative label: National Institute of Oceanography and Applied Geophysics
alternative label: Istituto Nazionale di Oceanografia e di Geofisica Sperimentale @it
broader: ITINERIS Organisation
modified: 2025-07-15T15:30:45
created: 2025-01-09T10:08:58

UNIFI
type: Concept
in scheme: Environmental Research Infrastructure
alternative label: University of Florence
alternative label: Università degli Studi di Firenze @it
broader: ITINERIS Organisation
modified: 2025-07-15T15:39:25
created: 2025-01-09T10:09:51

UNIVE
type: Concept
in scheme: Environmental Research Infrastructure
alternative label: Ca' Foscari University of Venice
alternative label: Università Ca' Foscari Venezia @it
alternative label: Università Ca' Foscari @it
broader: ITINERIS Organisation
modified: 2025-07-15T15:29:44
created: 2025-01-09T10:10:48

CNR-IBBRBA
type: Concept
in scheme: Environmental Research Infrastructure
alternative label: National Research Council-Institute of Biosciences and Bioresources Bari
alternative label: Istituto di Bioscienze e Biorisorse - Sede di Bari @it
broader: CNR-IBBR
modified: 2025-07-15T15:34:55
created: 2025-01-09T10:28:35

CNR-IBBRNA
type: Concept
in scheme: Environmental Research Infrastructure
alternative label: National Research Council-Institute of Biosciences and Bioresources Naples
alternative label: Istituto di Bioscienze e Biorisorse - Sede di Napoli @it
broader: CNR-IBBR
modified: 2025-07-15T15:40:18
created: 2025-01-09T10:29:20

CNR-IPSPFI
type: Concept
in scheme: Environmental Research Infrastructure
alternative label: Istituto per la Protezione Sostenibile delle Piante - Sede di Firenze
alternative label: National Research Council - Institute for Sustainable Plant Protection Florence
broader: CNR-IPSP
modified: 2025-06-19T10:48:27
created: 2025-01-09T10:31:11

CNR-IPSPNA
type: Concept
in scheme: Environmental Research Infrastructure
alternative label: Istituto per la Protezione Sostenibile delle Piante - Sede di Portici @it
alternative label: National Research Council - Institute for Sustainable Plant Protection Portici
broader: CNR-IPSP
modified: 2025-07-15T15:41:43
created: 2025-01-09T10:33:45

CNR-IRETFI
type: Concept
in scheme: Environmental Research Infrastructure
alternative label: Istituto di Ricerca sugli Ecosistemi Terrestri - Sede di Firenze
alternative label: National Research Council - Research Institute on Terrestrial Ecosystems Florence @it
broader: CNR-IRET
modified: 2025-07-15T15:33:04
created: 2025-01-09T10:37:07

CNR-IRETRM
type: Concept
in scheme: Environmental Research Infrastructure
alternative label: Istituto di Ricerca sugli Ecosistemi Terrestri - Sede Montelibretti @it
alternative label: National Research Council - Research Institute on Terrestrial Ecosystems Montelibretti
broader: CNR-IRET
modified: 2025-07-15T15:42:07
created: 2025-01-09T10:37:56

CNR-ISACBO
type: Concept
in scheme: Environmental Research Infrastructure
alternative label: Istituto di Scienze dell'Atmosfera e del Clima - Sede di Bologna @it
alternative label: National Research Council - Institute of Atmospheric Sciences and Climate Bologna
broader: CNR-ISAC
modified: 2025-07-15T15:34:02
created: 2025-01-09T10:38:37

CNR-ISACLE
type: Concept
in scheme: Environmental Research Infrastructure
alternative label: Istituto di Scienze dell'Atmosfera e del Clima - Sede di Lecce @it
alternative label: National Research Council - Institute of Atmospheric Sciences and Climate Lecce
broader: CNR-ISAC
modified: 2025-07-15T15:37:13
created: 2025-01-09T10:39:06

CNR-ISACLT
type: Concept
in scheme: Environmental Research Infrastructure
alternative label: Istituto di Scienze dell'Atmosfera e del Clima - Sede di Lamezia Terme @it
alternative label: National Research Council - Institute of Atmospheric Sciences and Climate Lamezia Terme
broader: CNR-ISAC
modified: 2025-07-15T15:30:26
created: 2025-01-09T10:39:38

CNR-ISMARBO
type: Concept
in scheme: Environmental Research Infrastructure
alternative label: Istituto di Scienze Marine - Sede di Bologna @it
alternative label: National Research Council - Institute of Marine Science Bologna
broader: CNR-ISMAR
modified: 2025-07-15T15:37:49
created: 2025-01-09T10:40:55

CNR-ISMARNA
type: Concept
in scheme: Environmental Research Infrastructure
alternative label: Istituto di Scienze Marine - Sede di Napoli @it
alternative label: National Research Council - Institute of Marine Science Naples
broader: CNR-ISMAR
modified: 2025-07-15T15:40:35
created: 2025-01-09T10:41:35

CNR-ISMARRM
type: Concept
in scheme: Environmental Research Infrastructure
alternative label: Istituto di Scienze Marine - Sede di Roma @it
alternative label: National Research Council - Institute of Marine Science Rome
broader: CNR-ISMAR
modified: 2025-07-15T15:32:14
created: 2025-01-09T10:43:06

CNR-ISMARSP
type: Concept
in scheme: Environmental Research Infrastructure
alternative label: Istituto di Scienze Marine - Sede di Lerici
alternative label: National Research Council - Institute of Marine Science Lerici
broader: CNR-ISMAR
modified: 2025-06-19T10:53:15
created: 2025-01-09T10:43:27

CNR-ISMARVE
type: Concept
in scheme: Environmental Research Infrastructure
alternative label: Istituto di Scienze Marine - Sede di Venezia @it
alternative label: National Research Council - Institute of Marine Science Venice
broader: CNR-ISMAR
modified: 2025-07-15T15:38:54
created: 2025-01-09T10:43:58

CNR-ISPBO
type: Concept
in scheme: Environmental Research Infrastructure
alternative label: Istituto di Scienze Polari - Sede di Bologna @it
alternative label: National Research Council - Institute of Polar Sciences Bologna
broader: CNR-ISP
modified: 2025-07-15T15:35:46
created: 2025-01-09T10:44:28

CNR-ISPME
type: Concept
in scheme: Environmental Research Infrastructure
alternative label: Istituto di Scienze Polari - Sede di Messina @it
alternative label: National Research Council - Institute of Polar Sciences Messina
broader: CNR-ISP
modified: 2025-07-15T15:35:59
created: 2025-01-09T10:45:02

INFN-BA
type: Concept
in scheme: Environmental Research Infrastructure
alternative label: National Institute for Nuclear Physics Bari
alternative label: Istituto Nazionale di Fisica Nucleare - Sede di Bari @it
broader: ITINERIS Operative Unit
modified: 2025-07-15T15:32:47
created: 2025-01-10T09:53:56

INFN-FI
type: Concept
in scheme: Environmental Research Infrastructure
alternative label: National Institute for Nuclear Physics Florence
alternative label: Istituto Nazionale di Fisica Nucleare - Sede di Firenze @it
broader: ITINERIS Operative Unit
modified: 2025-07-15T15:36:11
created: 2025-01-10T10:24:27

INFN-GE
type: Concept
in scheme: Environmental Research Infrastructure
alternative label: National Institute for Nuclear Physics Genova
alternative label: Istituto Nazionale di Fisica Nucleare - Sede di Genova @it
broader: ITINERIS Operative Unit
modified: 2025-07-15T15:41:12
created: 2025-01-10T10:25:02

INFN-LNS
type: Concept
in scheme: Environmental Research Infrastructure
alternative label: National Institute for Nuclear Physics Laboratori Nazionali del Sud
alternative label: Istituto Nazionale di Fisica Nucleare - Laboratori Nazionali del Sud @it
broader: ITINERIS Operative Unit
modified: 2025-07-15T15:32:33
created: 2025-01-10T10:33:11

INGV-BO
type: Concept
in scheme: Environmental Research Infrastructure
alternative label: National Institute of Geophysics and Volcanology Bologna
alternative label: Istituto Nazionale di Geofisica e Vulcanologia - Sede di Bologna @it
broader: ITINERIS Operative Unit
modified: 2025-07-15T15:40:47
created: 2025-01-10T10:34:05

INGV-WIS
type: Concept
in scheme: Environmental Research Infrastructure
alternative label: National Institute of Geophysics and Volcanology ESMO WESTERN IONIAN SEA
alternative label: Istituto Nazionale di Geofisica e Vulcanologia - ESMO WESTERN IONIAN SEA @it
broader: ITINERIS Operative Unit
modified: 2025-07-15T15:34:29
created: 2025-01-10T10:34:48

OGS-CGN
type: Concept
in scheme: Environmental Research Infrastructure
alternative label: Ship management group of OGS
alternative label: Istituto Nazionale di Oceanografia e di Geofisica Sperimentale - Gestione mezzi navali @it
broader: ITINERIS Operative Unit
modified: 2025-07-15T15:35:21
created: 2025-01-10T11:14:28

OGS-CRS
type: Concept
in scheme: Environmental Research Infrastructure
alternative label: Center for Seismological Research of OGS
alternative label: Istituto Nazionale di Oceanografia e di Geofisica Sperimentale - Centro di Ricerche Sismologiche @it
broader: ITINERIS Operative Unit
modified: 2025-07-15T15:38:12
created: 2025-01-10T11:14:56

OGS-GEO
type: Concept
in scheme: Environmental Research Infrastructure
alternative label: Istituto Nazionale di Oceanografia e di Geofisica Sperimentale - Sezione di Geofisica @it
alternative label: Section of Geophysic of OGS
broader: ITINERIS Operative Unit
modified: 2025-07-15T15:31:30
created: 2025-01-10T11:16:36

OGS-OCE
type: Concept
in scheme: Environmental Research Infrastructure
alternative label: Istituto Nazionale di Oceanografia e di Geofisica Sperimentale - Sezione di Oceanografia @it
alternative label: Section of Oceanography of OGS
broader: ITINERIS Operative Unit
modified: 2025-07-15T15:31:12
created: 2025-01-10T11:17:01

UNIFI-CPC
type: Concept
in scheme: Environmental Research Infrastructure
alternative label: University of Florence - Civil Protection Center
alternative label: Università di Firenze - Centro per la Protezione Civile @it
broader: ITINERIS Operative Unit
modified: 2025-07-15T15:33:19
created: 2025-01-10T11:17:33

UNIFI-DAGRI
type: Concept
in scheme: Environmental Research Infrastructure
alternative label: University of Florence - Department of Agricultural, Food, Environmental and Forestry Science and Technology
alternative label: Università di Firenze - Dipartimento di Scienze e Tecnologie Agrarie, Alimentari, Ambientali e Forestali @it
broader: ITINERIS Operative Unit
modified: 2025-07-15T15:33:34
created: 2025-01-10T11:18:31

UNIFI-SMA
type: Concept
in scheme: Environmental Research Infrastructure
alternative label: University of Florence - Museum System, SMA
alternative label: Università di Firenze - Sistema Museale di Ateneo @it
broader: ITINERIS Operative Unit
modified: 2025-07-15T15:31:47
created: 2025-01-10T11:19:16

UNIVE-DAIS
type: Concept
in scheme: Environmental Research Infrastructure
alternative label: Ca' Foscari University of Venice - Department of Environmental Sciences, Informatics and Statistics
alternative label: Università Ca' Foscari Venezia - Dipartimento di Scienze Ambientali, Informatica e Statistica @it
broader: ITINERIS Operative Unit
modified: 2025-07-15T15:35:09
created: 2025-01-10T11:19:42

Authentification and authorization service
type: Concept
definition: A service that mediates access to digital objects according to specifed conditions.
in scheme: Environmental Research Infrastructure
broader: FAIR-Enabling Resource
modified: 2025-01-15T10:15:07
created: 2025-01-15T10:14:49

Communication protocol
type: Concept
definition: A set of rules of how messages are structured and exchanged.
in scheme: Environmental Research Infrastructure
broader: FAIR-Enabling Resource
broader: Access
modified: 2025-06-06T15:23:17
created: 2025-01-15T10:16:36

Access
type: Concept
definition: Access refers to the legitimate and authorized physical, remote and virtual admission to, interactions with and use of Research Infrastructures and to the services offered by Research Infrastructures to Users.
in scheme: Environmental Research Infrastructure
broader: Service
modified: 2025-07-15T14:47:12
created: 2025-03-03T11:50:08
source: https://doi.org/10.2777/8299402

Knowledge representation language
type: Concept
definition: A language specification that enables knowledge to be processed by machines.
in scheme: Environmental Research Infrastructure
broader: FAIR-Enabling Resource
modified: 2025-01-15T10:18:14
created: 2025-01-15T10:17:55

Metadata schema
type: Concept
definition: A specification that specifies the structured representation of metadata describing attributes of data or other digital objects in terms of semantics, syntax and optionality.
in scheme: Environmental Research Infrastructure
broader: FAIR-Enabling Resource
broader: Metadata
modified: 2025-02-13T10:30:27
created: 2025-01-15T11:07:25

Metadata
type: Concept
definition: Data about data. It is data (or information) that defines and describes the characteristics of other data. It is used to improve the understanding and use of the data.
in scheme: Environmental Research Infrastructure
broader: Digital Object
modified: 2025-02-12T16:09:42
created: 2025-02-07T10:36:03

Policy document
type: Concept
definition: A document embodying a policy that descibes and defines how something should be done.
in scheme: Environmental Research Infrastructure
broader: Digital Object
modified: 2025-07-16T09:54:55
created: 2025-02-07T10:35:20

Software
type: Concept
definition: Sequential operating programs and data which instruct the functioning of a digital computer.
in scheme: Environmental Research Infrastructure
broader: Digital Object
modified: 2025-02-12T15:10:51
created: 2025-02-07T10:35:29

Semantic Artefact
type: Concept
definition: Semantic artefacts (SA) describe the meaning and structure of digital objects and the relations among them. SA, such as controlled vocabularies, thesauri, ontologies etc., are machine-actionable, interpretable and readable formalisation of a conceptualisation and are represented using appropriate formats and serialisations, including RDF and non-RDF standards.
in scheme: Environmental Research Infrastructure
broader: Digital Object
modified: 2025-02-13T11:42:53
created: 2025-02-07T10:35:44
source: https://doi.org/10.1038/s41597-024-03185-4

Data product
type: Concept
definition: A data product is defined as the application of a unique blend of skills from analytics, engineering and communication aiming at generating value from the data itself to provide benefit to another entity.
in scheme: Environmental Research Infrastructure
broader: Data
modified: 2025-07-15T16:01:54
created: 2025-02-07T10:35:54
source: https://doi.org/10.1007/978-3-030-11821-1_4

Data
type: Concept
definition: Facts, measurements, recordings, records, or observations about the world collected by scientists and others, with a minimum of contextual interpretation. Data may be in any format or medium taking the form of writings, notes, numbers, symbols, text, images, films, video, sound recordings, pictorial reproductions, drawings, designs or other graphical representations, procedural manuals, forms, diagrams, work flow charts, equipment descriptions, data files, data processing algorithms, or statistical records.
in scheme: Environmental Research Infrastructure
broader: Digital Object
modified: 2025-06-06T10:09:29
created: 2025-02-07T10:36:16

Code
type: Concept
definition: Software Item representing a set of computer instructions and data definitions expressed in a programming language or in a form output by an assembler, compiler, or other translator.
in scheme: Environmental Research Infrastructure
broader: Digital Object
modified: 2025-02-07T15:34:51
created: 2025-02-07T10:36:10
source: https://dev.nemo.inf.ufes.br/seon/SwO.html#SwO_Code

Dataset
type: Concept
definition: A set or collection of data, records or information that constitutes distinct units of information in the knowledge generation process.
in scheme: Environmental Research Infrastructure
broader: Data
modified: 2025-06-12T10:34:10
created: 2025-03-03T11:48:40

Protocol
type: Concept
definition: A plan specification which has sufficient level of detail and quantitative information to communicate it between investigation agents, so that different investigation agents will reliably be able to independently reproduce the process.
in scheme: Environmental Research Infrastructure
broader: Digital Object
modified: 2025-06-06T15:21:44
created: 2025-02-07T10:36:30

Metadata Standard
type: Concept
definition: A metadata standard i a set of agreed-upon and documented guidelines, specifications, accepted practices, technical requirements, or terminologies that have been prepared by a standards developing organisation or group, and published in accordance with established procedures. These can be mandatory or voluntary and are distinct from Acts, regulations, and codes, although standards can be referenced in those legal instruments.
in scheme: Environmental Research Infrastructure
broader: Metadata schema
modified: 2025-02-13T10:42:22
created: 2025-02-13T10:41:05

Authority file
type: Concept
definition: Authority files are lists of terms that are used to control the variant names for an entity or the domain value for a particular field. Examples include names for countries, individuals, and organizations. Nonpreferred terms may be linked to the preferred versions. This type of KOS generally does not include a deep organisation or complex structure. The presentation may be alphabetical or organised by a shallow classification scheme. A limited hierarchy may be applied to allow for simple navigation, particularly when the authority file is being accessed manually or is extremely large. Examples of authority files include the Library of Congress Name Authority File and the Getty Geographic Authority File.
in scheme: Environmental Research Infrastructure
broader: Semantic Artefact
modified: 2025-02-24T08:54:18
created: 2025-02-13T11:50:30
source: https://www.clir.org/pubs/reports/pub91/1knowledge/

Categorisation scheme
type: Concept
definition: A categorisation scheme is a set of controlled terms whose entities are divided into “buckets” or broad topic levels. Some examples provide a hierarchical arrangement of numeric or alphabetic notation to represent broad topics. These types of semantic artefacts lack the explicit relationships presented in a thesaurus.
in scheme: Environmental Research Infrastructure
broader: Semantic Artefact
modified: 2025-06-06T16:02:49
created: 2025-02-13T11:50:45
source: https://www.clir.org/pubs/reports/pub91/1knowledge/

Concept
definition: Concepts are the units of thought —ideas, meanings, or (categories of) objects and events—which underlie many knowledge organization systems. As such, concepts exist in the mind as abstract entities which are independent of the terms used to label them. In SKOS, concepts are identified with URIs, labeled with strings in one or more natural languages, documented with various types of note, semantically related to each other in informal hierarchies and association networks, and aggregated into concept schemes.
in scheme: Environmental Research Infrastructure
broader: Semantic Artefact
modified: 2025-06-18T15:15:43
created: 2025-02-13T11:50:56
source: https://www.w3.org/TR/skos-primer/

Controlled vocabulary
type: Concept
definition: List of standardised terminology, words, or phrases, used for indexing or content analysis and information retrieval, usually in a defined information domain.
in scheme: Environmental Research Infrastructure
broader: Semantic Artefact
modified: 2025-02-24T08:58:29
created: 2025-02-13T11:51:22

Gazetteer
type: Concept
definition: A gazetteer is a list of place names. Traditional gazetteers have been published as books or have appeared as indexes to atlases. Each entry may also be identified by feature type, such as river, city, or school. An example is the U.S. Code of Geographic Names. Geospatially referenced gazetteers provide coordinates for locating the place on the earth’s surface. The term gazetteer has several other meanings, including an announcement publication such as a patent or legal gazetteer. These gazetteers are often organised using classification schemes or subject categories.
in scheme: Environmental Research Infrastructure
broader: Semantic Artefact
modified: 2025-02-24T09:03:00
created: 2025-02-13T11:51:36
source: https://www.clir.org/pubs/reports/pub91/1knowledge/

Glossary
type: Concept
definition: An alphabetical list of terms concerned with a particular subject, field or area of usage that includes accompanying definitions.
in scheme: Environmental Research Infrastructure
broader: Semantic Artefact
modified: 2025-06-13T14:27:21
created: 2025-02-13T11:51:45

Ontology
type: Concept
definition: A formal model that allows knowledge to be represented for a specific domain. An ontology describes the types of things that exist (classes), the relationships between them (properties) and the logical ways those classes and properties can be used together (axioms).
in scheme: Environmental Research Infrastructure
broader: Semantic Artefact
modified: 2025-02-24T09:29:38
created: 2025-02-13T11:51:55
source: https://www.w3.org/TR/ld-glossary/#ontology

Semantic annotation
type: Concept
definition: Link from an information object (single datum, data set, data container) to a concept within a conceptual model, enabling the discovery of the meaning of the information object by human and machines.
in scheme: Environmental Research Infrastructure
broader: Semantic Artefact
modified: 2025-02-24T10:01:53
created: 2025-02-13T11:52:03
source: https://doi.org/10.5281/zenodo.3465752

Subject heading
type: Concept
definition: A subject heading is a set of controlled terms to represent the subjects of items in a collection. Subject headings can be extensive and cover a broad range of subjects; however, their structure is generally very shallow, with a limited hierarchical structure. In use, subject headings tend to be coordinated, with rules for how they can be joined to provide concepts that are more specific.
in scheme: Environmental Research Infrastructure
broader: Semantic Artefact
modified: 2025-02-21T11:05:54
created: 2025-02-13T11:52:18

Taxonomy
type: Concept
definition: Taxonomy is a formal representation of relationships between items in a hierarchical structure.
in scheme: Environmental Research Infrastructure
broader: Semantic Artefact
modified: 2025-06-13T14:18:14
created: 2025-02-13T11:52:24

Thesaurus
type: Concept
definition: A type of controlled vocabulary used in information retrieval applications for indexing or tagging purposes, in which relationships between terms are made explicit. These are normally hierarchical relationships (is-a, subsumption; e.g. a cow is a mammal), equivalency relationships relating non-preferred terms to preferred terms (e.g. pitch and frequency), or associative relationships, in which the relationship that exists is neither one of hierarchy or equivalence, but rather one of similarity (e.g. sports and leisure pursuits).
in scheme: Environmental Research Infrastructure
broader: Semantic Artefact
modified: 2025-06-06T16:25:18
created: 2025-02-13T11:52:29
source: http://ecoportal.lifewatch.eu/ontologies/FABIO/Thesaurus

Physical Sciences and Engineering
type: Concept
definition: The Physical Sciences and Engineering domain includes Astronomy and Astroparticle Physics, Particle and Nuclear Physics, and Analytical Physics. This scientific domain enables the understanding of the physical structure of nature and its interactions over an enormous range of distances, energy and time, from the Big Bang to now, and from subnuclear scales to the whole observable Universe.
in scheme: Environmental Research Infrastructure
alternative label: PSE
broader: ESFRI domain
modified: 2025-07-15T16:22:11
created: 2025-02-24T10:51:29
source: https://roadmap2021.esfri.eu/landscape-analysis/section-1/physical-sciences-engineering/

Health and Food
type: Concept
definition: The Health and Food domain focuses on topics such as climate change, biodiversity, and food security, trying to ensure environment supporting conditions for healthy and diverse population that can cope with major challenges of health including civilisation disorders, healthy ageing, and infection diseases.
in scheme: Environmental Research Infrastructure
broader: ESFRI domain
modified: 2025-07-15T16:22:46
created: 2025-02-24T10:51:45
source: https://roadmap2021.esfri.eu/landscape-analysis/section-1/health-food/

Environment
type: Concept
definition: Environmental research as a scientific domain focuses on understanding how the Earth system works at various spatial and temporal scales. Environmental research requires comprehensive observations integrated with relevant experimental and modelling approaches which are essential for understanding and predicting the Earth’s environmental system functions. A federated approach to IT resources and e-science facilities is also necessary together with liable data policies compliant with the FAIR principle.
in scheme: Environmental Research Infrastructure
broader: ESFRI domain
modified: 2025-03-24T15:48:23
created: 2025-02-24T10:51:58
source: https://roadmap2021.esfri.eu/

Atmosphere
type: Concept
definition: The atmosphere domain is the domain that focuses on the study of the region comprised between the Earth's surface and an altitude of approximately 100 km. The research activities carried out within this domain include the collection of observations of aerosol and trace gases (e.g. greenhouse gases and reactive gases), the study of atmospheric dynamics and of atmospheric quality, as well as the study of changes in atmospheric composition due to natural and anthropogenic pressures (e.g. fires) and the determination of the atmospheric boundary layer height (ABLH).
in scheme: Environmental Research Infrastructure
broader: Environment
modified: 2025-03-24T15:48:15
created: 2025-02-24T10:52:17

Geosphere landsurface
type: Concept
definition: The geosphere landsurface domain is the domain that focuses on the study of the solid Earth. The research activities carried out within this domain include geophysical surveys, airborne and space borne observations, fiber optical strain measurements, and ocean drilling. Such research activities gather remote sensing data but also geochemical, geophysical, geological, geodetic and seismological data.
in scheme: Environmental Research Infrastructure
alternative label: Geosphere
broader: Environment
modified: 2025-07-15T16:03:41
created: 2025-02-24T10:52:35

Marine
type: Concept
definition: The marine domain is the domain that focuses on the study of the ocean and of marine ecosystems including their freshwater river outflows. The research activities carried out within this domain are based on marine observations derived from different ocean observing systems, ships and Gliders. Research activities also include the long-term monitoring of Essential Ocean Variables (EOVs) such as physical, biogeochemical and geological ocean variables, Essential Biological Variables (EBVs), and Essential Climate Variables (ECVs).
in scheme: Environmental Research Infrastructure
broader: Environment
modified: 2025-02-24T11:25:53
created: 2025-02-24T10:52:45

Terrestrial biosphere
type: Concept
definition: The terrestrial biosphere is the domain that focuses on the study of biodiversity and of inland waters (rivers and lakes). The research activities carried out within this domain include continuous and long-term ecosystem monitoring, manipulation experiments, phenotyping, specimen collections and modeling.
in scheme: Environmental Research Infrastructure
broader: Environment
modified: 2025-02-24T11:26:10
created: 2025-02-24T10:52:59

c f3ce46c0
broader: Device
modified: 2025-06-06T15:05:37

Device
type: Concept
definition: Device used for making observations and measurements, or collecting samples alone or in conjunction with one or more supplementary devices.
in scheme: Environmental Research Infrastructure
broader: Facility
modified: 2025-06-24T10:30:50
created: 2025-06-06T09:56:01

Facility
type: Concept
definition: A facility supports the undertaking of scientific research by collecting, processing or archiving data about objects whose properties (e.g. physical, chemical, biological or other aspects of environmental conditions) are repeatedly observed or measured.
in scheme: Environmental Research Infrastructure
top concept of: Environmental Research Infrastructure
alternative label: Research facility
alternative label: Scientific facility
modified: 2025-07-22T15:50:14
created: 2025-03-28T13:52:41

Data center
type: Concept
definition: A data center is a facility that houses a network of computing and storage resources used to collect, process, store, and distribute large amounts of data. It typically includes servers, networking equipment, storage systems, etc.
in scheme: Environmental Research Infrastructure
alternative label: Data centre
broader: Facility
modified: 2025-04-07T15:06:44
created: 2025-02-24T13:12:04
source: https://www.techtarget.com/searchdatacenter/definition/data-center

Mesocosm
type: Concept
definition: A mesocosm is a vivarium that is embedded within a natural environment and is used to place a relatively small part of that environment under experimental control for the purposes of scientific investigation.
in scheme: Environmental Research Infrastructure
broader: Facility
modified: 2025-03-28T13:53:55
created: 2025-02-24T14:04:37

Laboratory
type: Concept
definition: A laboratory is a facility that provides controlled conditions in which scientific or technological research, experiments, and measurement may be performed.
in scheme: Environmental Research Infrastructure
broader: Facility
modified: 2025-07-15T16:04:28
created: 2025-02-24T14:16:16
source: https://en.wikipedia.org/wiki/Laboratory

Application Programming Interface
type: Concept
definition: An Application Programming Interface (API) for the World Wide Web that allows different software applications to communicate with each other.
in scheme: Environmental Research Infrastructure
alternative label: API
broader: e-Service
modified: 2025-03-27T12:55:43
created: 2025-02-24T14:45:01

Registry
type: Concept
definition: A registry is a service that provides standardised information about trusted repositories to both human and machine users by the assignment of a permanent, unique and unambiguous identifier.
in scheme: Environmental Research Infrastructure
broader: e-Service
modified: 2025-06-06T16:01:15
created: 2025-02-24T14:52:28

Repository
type: Concept
definition: Physical or digital storage location that can house, preserve, manage, and provide access to many types of digital and physical materials in a variety of formats. Materials in online repositories are curated to enable search, discovery, and reuse. There must be sufficient control for the physical and digital material to be authentic, reliable, accessible and usable on a continuing basis.
in scheme: Environmental Research Infrastructure
alternative label: Archive
broader: e-Service
modified: 2025-06-06T15:49:16
created: 2025-02-24T14:55:18

Metadata catalogue
type: Concept
definition: Catalogue containing metadata records that enables services to find data and services.
in scheme: Environmental Research Infrastructure
broader: Registry
modified: 2025-06-06T10:08:06
created: 2025-02-24T14:57:46

Data portal
type: Concept
definition: It is a web platform for publishing data. It provides a catalogue of data that is made available and findable by users, and it offers organisations a publishing workflow.
in scheme: Environmental Research Infrastructure
broader: Repository
modified: 2025-06-06T16:08:31
created: 2025-02-24T14:58:25
source: https://data.ca.gov/pages/open-data-glossary#dataset

Semantic repository
type: Concept
definition: A semantic repository is a service that enables users to query the contents of semantic artefacts. It offers advanced features for searching, browsing, managing metadata, customising and mapping.
in scheme: Environmental Research Infrastructure
broader: Repository
modified: 2025-06-06T16:11:47
created: 2025-02-24T15:00:32
source: https://doi.org/10.1038/s41597-024-03185-4

Semantic registry
type: Concept
definition: A semantic registry is a service that helps reuse or find semantic artefacts by simply listing them or offering structured metadata to describe them. Yet, a semantic registry does not support additional services beyond the description of the items, e.g., a content analysis or a search index on the semantic artefacts’ content.
in scheme: Environmental Research Infrastructure
broader: Registry
modified: 2025-03-27T14:32:02
created: 2025-02-24T15:01:36
source: https://doi.org/10.1038/s41597-024-03185-4

Virtual Research Infrastructure
type: Concept
definition: A Virtual Research Infrastructure (VRI) is a research facility that provides digital tools, services, and data to support scientific research without requiring physical presence at a specific location. These infrastructures enable researchers to access and analyse data, collaborate remotely, and use computing resources across different institutions and countries.
in scheme: Environmental Research Infrastructure
alternative label: VRI
broader: Research Infrastructure
modified: 2025-03-19T14:47:08
created: 2025-03-03T11:39:40

Physical Research Infrastructure
type: Concept
definition: A physical Research Infrastructure is a facility that provides physical access to major scientific equipment including observatories, laboratories, instruments, knowledge-based resources such as collections, archives and scientific data, to foster scientific research and innovation. Researchers use these resources to perform experiments, collect data and share knowledge in different areas.
in scheme: Environmental Research Infrastructure
broader: Research Infrastructure
modified: 2025-03-20T14:54:04
created: 2025-03-03T11:40:04

ITINERIS Catalogue
type: Concept
definition: A metadata catalogue of facilities, services, data and other research products provided by the Research Infrastructures participating in ITINERIS.
in scheme: Environmental Research Infrastructure
broader: Metadata catalogue
modified: 2025-07-15T15:21:05
created: 2025-03-03T11:45:43
source: https://itineris.cnr.it/wp-content/uploads/2024/07/ITINERIS_2nd_annual_meeting_slides-1.pdf

ITINERIS Access Platform
type: Concept
definition: A centralized platform to request physical and remote access within the available programs, offering guidance on access modes, eligibility, and application procedures.
in scheme: Environmental Research Infrastructure
broader: e-Service
modified: 2025-06-18T10:01:40
created: 2025-03-03T11:46:02

ITINERIS Data Hub
type: Concept
definition: ITINERIS Data Hub is the access point for data produced within ITINERIS. The Data Hub facilitates data discovery through a web interface for a multi-stakeholder approach.
in scheme: Environmental Research Infrastructure
broader: Repository
related: Data portal
modified: 2025-06-06T11:31:47
created: 2025-03-03T11:46:21

ITINERIS Virtual Research Environment
type: Concept
definition: Advanced digital platforms designed to empower users with cutting-edge tools for cross-disciplinary environmental analysis. ITINERIS Virtual Research Environments integrate data, models, and computational resources from multiple Research Infrastructures, enabling researchers, policymakers, and stakeholders to address complex environmental challenges through collaborative and innovative approaches.
in scheme: Environmental Research Infrastructure
alternative label: ITINERIS VRE
broader: Virtual Research Environment
modified: 2025-06-06T15:46:29
created: 2025-03-03T11:46:40
source: https://itineris.cnr.it/wp8-virtual-research-environments-and-cross-disciplinary-activities/

Virtual Research Environment
type: Concept
definition: Virtual Research Environments (VREs) are platforms providing user-centric support for discovering and selecting data and software services from different sources, and composing and executing application workflows, also referred to as Virtual Laboratories or Science Gateways. VREs play a direct role in the lifecycle of research activities performed by scientists, for example, the planning of experiments, search and discovery of resources from different sources (notably including RIs), integration of services into cohesive workflows and collaboration with other scientists. Graphical environments, workflow management systems, and data analytics tools are typical components of such environments.
in scheme: Environmental Research Infrastructure
alternative label: VRE
broader: Digital Object
modified: 2025-06-06T15:08:00
created: 2025-06-06T11:29:54

ITINERIS Training Centre
type: Concept
definition: A dedicated platform offering courses, hands-on training, workshops and educational resources to enhance researchers', technicians', and stakeholders' skills in utilizing data, tools, and Virtual Research Environments developed by the environmental Research Infrastructures involved in ITINERIS. It promotes best practices, interdisciplinary collaboration, and equips the next generation of scientists with advanced knowledge and practical skills for innovation and sustainable solutions.
in scheme: Environmental Research Infrastructure
broader: e-Service
modified: 2025-06-18T10:02:32
created: 2025-03-03T11:47:19
source: https://itineris.cnr.it/wp3-itineris-training-centre/

Access condition
type: Concept
definition: It refers to the different methods of access to a Research Infrastructure, acknowledging the different purposes of access, in function of possible contractual and legal obligations. Access to any Research Infrastructure may be regulated according to one or any combination of access condition types.
in scheme: Environmental Research Infrastructure
alternative label: Access mode
broader: Access
modified: 2025-06-18T14:29:59
created: 2025-03-03T11:50:17
source: https://doi.org/10.2777/8299402

Access type
type: Concept
definition: The term 'Access type' is used to denote the method by which a device or user is able to access a facility or service.
in scheme: Environmental Research Infrastructure
broader: Access
modified: 2025-04-07T13:46:21
created: 2025-03-03T11:50:26

Authentication and authorization
type: Concept
definition: A service that mediates access to physical and digital objects, facilities and services, according to specifed conditions.
in scheme: Environmental Research Infrastructure
broader: Access
modified: 2025-06-19T12:22:15
created: 2025-03-03T11:50:46

Excellence-driven access
type: Concept
definition: The excellence-driven condition is exclusively dependent on the scientific excellence, originality, quality and technical and ethical feasibility of an application, evaluated through peer review conducted by internal or external experts. It enables users to get access to the best facilities, resources and services wherever located. This access condition enables collaborative research and technological development efforts across geographical and disciplinary boundaries.
in scheme: Environmental Research Infrastructure
broader: Access condition
modified: 2025-06-06T14:56:26
created: 2025-03-03T11:52:00
source: https://doi.org/10.2777/8299402

Market-driven access
type: Concept
definition: The market-driven access condition applies when access is defined through an agreement between the user and the Research Infrastructure, that will lead to a fee for the access and that may remain confidential.
in scheme: Environmental Research Infrastructure
broader: Access condition
modified: 2025-06-06T14:58:06
created: 2025-03-03T11:52:13
source: https://doi.org/10.2777/8299402

Technical need-driven access
type: Concept
definition: Technical need-driven access means access primarly depending on the technical needs of the user to increase the performance and quality of its research activities.
in scheme: Environmental Research Infrastructure
broader: Access condition
modified: 2025-03-21T16:01:13
created: 2025-03-03T11:52:25

Wide Virtual Access
type: Concept
definition: The wide access guarantees the broadest possible access to scientific data, services and facilities provided by the Research Infrastructure to any user with no restrictions.
in scheme: Environmental Research Infrastructure
broader: Access condition
modified: 2025-06-06T14:59:46
created: 2025-03-03T11:52:31
source: https://doi.org/10.2777/8299402

Physical access
type: Concept
definition: Physical access is “in-person” access, when users physically visit an infrastructure, facility or equipment.
in scheme: Environmental Research Infrastructure
broader: Access type
modified: 2025-03-21T16:02:31
created: 2025-03-03T11:52:50
source: https://doi.org/10.2777/8299402

Remote access
type: Concept
definition: Remote access is access to resources and services offered by the Research Infrastructure without users physically visiting the infrastructure’s facilities. This can entail shipping of samples, exchange of data. It can include access to selective digital services such as access to high-performance computing.
in scheme: Environmental Research Infrastructure
broader: Access type
modified: 2025-03-21T16:03:00
created: 2025-03-03T11:52:54
source: https://doi.org/10.2777/8299402

Transnational access
type: Concept
definition: Transnational Access (TNA) means free of charge, transnational access to research infrastructures or installations for selected user groups. The access includes the logistical, technological and scientific support and the specific training that is usually provided to external researchers using the infrastructure.
in scheme: Environmental Research Infrastructure
alternative label: TNA
broader: Access type
modified: 2025-07-15T16:06:52
created: 2025-03-03T11:53:01
source: https://eu-interact.org/accessing-the-arctic/

Virtual access
type: Concept
definition: Virtual access means access to users provided through communication networks, such as access to data and digital services.
in scheme: Environmental Research Infrastructure
broader: Access type
modified: 2025-03-31T14:43:21
created: 2025-03-03T11:53:09
source: https://doi.org/10.2777/8299402

Hybrid access
type: Concept
definition: Hybrid access refers to any combination of physical, remote and virtual access.
in scheme: Environmental Research Infrastructure
broader: Access type
modified: 2025-03-21T16:02:02
created: 2025-03-03T11:53:53
source: https://doi.org/10.2777/8299402

Open Access
type: Concept
definition: Open Access refers to a resource that is immediately and permanently online, and free for all on the Web, without financial and technical barriers.The resource is either stored in the repository or referenced to an external journal or trustworthy archive.
in scheme: Environmental Research Infrastructure
alternative label: OA
broader: Best practice
broader: Access type
modified: 2025-06-06T15:13:01
created: 2025-03-03T11:53:59

AERO VRE
type: Concept
definition: The aerosol-biosphere Virtual Research Environment (AERO VRE) provides services for visualizing climatological charts of the aerosol types occurred at the different sites; indicators of the occurrence of the desert dust; statistical plots of the atmospheric boundary layer properties. All this information provides a crucial element for most activities on the atmosphere-biosphere-geosphere continuum.
in scheme: Environmental Research Infrastructure
alternative label: Aerosol-biosphere Virtual Research Environment
broader: ITINERIS Virtual Research Environment
modified: 2025-06-06T15:43:16
created: 2025-03-19T11:48:34
source: https://itineris.cnr.it/wp-content/uploads/2024/05/ITINERIS_summary_WP8.pdf

BIOMASS VRE
type: Concept
definition: The standing biomass Virtual Research Environment (BIOMASS VRE) addresses the response of aquatic ecosystems, and in particular of the standing biomass, to environmental change. The standing biomass dynamics are studied by integrating data resources, services and modelling tools of different environmental Research Infrastructures.
in scheme: Environmental Research Infrastructure
alternative label: Standing biomass Virtual Research Environment
broader: ITINERIS Virtual Research Environment
modified: 2025-06-06T15:44:41
created: 2025-03-19T11:49:08
source: https://itineris.cnr.it/wp-content/uploads/2024/05/ITINERIS_summary_WP8.pdf

CARBON VRE
type: Concept
definition: The carbon cycle Virtual Research Environment (CARBON VRE) provides services on the main carbon reservoirs (atmosphere, oceans, terrestrial biosphere and geosphere) and on direct anthropogenic emissions to characterize the carbon budget, its trends and fluxes at different spatial and temporal scales. The CARBON VRE includes local measurements, flux networks, regional-scale measurements, stable isotope approach and data-driven models, also establishing new measurement sites, to fill the gaps on key terrestrial ecosystems, and strengthening existing sites.
in scheme: Environmental Research Infrastructure
alternative label: Carbon cycle Virtual Research Environment
broader: ITINERIS Virtual Research Environment
modified: 2025-06-06T15:45:12
created: 2025-03-19T11:49:50
source: https://itineris.cnr.it/wp-content/uploads/2024/05/ITINERIS_summary_WP8.pdf

CPP VRE
type: Concept
definition: The Crop, Plants and Pests Virtual Research Environment (CPP VRE) make accessible an array of cross-platform distributed modelling solutions, data transformation tools, and cloud hosted computational facilities, allowing users to perform scenario analysis and digital twin components in an interactive way. Modelling solutions include established process-based models for crop production, water use, plant phenology, pest and disease spread, pathogens dynamics and impact, and cropping system management as well as advanced statistical methods for image classification and time series analysis.
in scheme: Environmental Research Infrastructure
alternative label: Crops, Plants and Pests Virtual Research Environment
broader: ITINERIS Virtual Research Environment
modified: 2025-06-06T15:45:55
created: 2025-03-19T11:50:19
source: https://itineris.cnr.it/wp-content/uploads/2024/05/ITINERIS_summary_WP8.pdf

CLIMA VRE
type: Concept
definition: A Virtual Research Environment to gather all the climatic variables from the ITINERIS environmental Research Infrastructure with the aim of identifying indicators and downstream effects of climate change. The CLIMA VRE represents a collaborative place where specific climatic datasets and tools are made available, enabling users to collaborate for identifying climatic indicators, run codes, share materials, and communicate in various ways. The CLIMA VRE also considers external datasets coming from other European initiatives like both the Copernicus Climate Change and the Copernicus Marine Services for the identification of the indicators.
in scheme: Environmental Research Infrastructure
alternative label: Virtual Research Environment on indicators and impacts of climate change
broader: ITINERIS Virtual Research Environment
modified: 2025-06-06T15:45:35
created: 2025-03-19T11:50:41
source: https://itineris.cnr.it/wp-content/uploads/2024/05/ITINERIS_summary_WP8.pdf

CZ VRE
type: Concept
definition: A Virtual Research Environment that addresses Critical Zone (CZ) dynamics in face of climate and environmental change linking biosphere, geosphere and atmosphere processes.
in scheme: Environmental Research Infrastructure
alternative label: Virtual Research Environment for Critical Zone services
broader: ITINERIS Virtual Research Environment
modified: 2025-07-15T16:08:08
created: 2025-03-19T11:51:18

DOWNSTREAM VRE
type: Concept
definition: The Virtual Research Environment on downstream effects of environmental change (DOWNSTREAM VRE) is dedicated to the use of Research Infrastructure data on the nexus of climate and environmental change effects, carbon, and Earth System response to provide tools for the visualization, analysis, and sharing of the data provided by the different Risks, focusing on the impact of environmental change in the marine and terrestrial domains.
in scheme: Environmental Research Infrastructure
alternative label: Virtual Research Environment on downstream effects of environmental change
broader: ITINERIS Virtual Research Environment
modified: 2025-06-06T15:47:46
created: 2025-03-19T11:51:55
source: https://itineris.cnr.it/wp-content/uploads/2024/05/ITINERIS_summary_WP8.pdf

ISOTOPE VRE
type: Concept
definition: The ISOTOPE Virtual Research Environment creates a national service to retrieve information and analysis tools to fill the gaps in the current ability to analyze isotopes from different matrices.
in scheme: Environmental Research Infrastructure
alternative label: Virtual Research Environment for the isotope database
broader: ITINERIS Virtual Research Environment
modified: 2025-06-06T15:46:27
created: 2025-03-19T11:52:45
source: https://itineris.cnr.it/wp-content/uploads/2024/05/ITINERIS_summary_WP8.pdf

EV VRE
type: Concept
definition: A Virtual Research Environment based on the Essential Climate Variables (ECVs) and Biodiversity Variables (EBVs) produced by Italian observatories and field campaigns.
in scheme: Environmental Research Infrastructure
alternative label: Essential Variables Virtual Research Environment
broader: ITINERIS Virtual Research Environment
modified: 2025-06-06T15:47:08
created: 2025-03-19T12:02:37
source: https://itineris.cnr.it/wp-content/uploads/2024/05/ITINERIS_summary_WP8.pdf

Terminology model
type: Concept
definition: A specification that defines qualified relations between entities describing data or other digital objects according to the Linked Data principles. This can include semantic data models and ontologies.
in scheme: Environmental Research Infrastructure
broader: Terminology Service
modified: 2025-04-14T13:28:21
created: 2025-03-19T13:25:14

Alignment
type: Concept
definition: A mapping between semantic elements. Semantic alignment requires a predicate indicating equivalence or broader/narrower relationship.
in scheme: Environmental Research Infrastructure
broader: Terminology Service
modified: 2025-04-14T13:30:59
created: 2025-03-19T13:25:28
source: Jana Martínková, Nick Juty, Alejandra Gonzalez Beltran, Carole Goble, Yann Le Franc, “Moving towards FAIR mappings and crosswalks”, Proceedings of the Joint Ontology Workshops (JOWO) - Episode X: The Tukker Zomer of Ontology, and satellite events co-located with the 14th International Conference on Formal Ontology in Information Systems (FOIS 2024), Enschede, The Netherlands, July 15-19, 2024. Vol 3882, https://ceur-ws.org/Vol-3882/

Mapping
type: Concept
definition: A mapping defines connections or relationships between different information elements by identifying similarities, correspondences, and alignments. Mappings include different types of connections, depending on the level of the elements that are being mapped.
in scheme: Environmental Research Infrastructure
broader: Terminology Service
modified: 2025-03-27T14:57:54
created: 2025-03-19T13:25:35
source: Jana Martínková, Nick Juty, Alejandra Gonzalez Beltran, Carole Goble, Yann Le Franc, “Moving towards FAIR mappings and crosswalks”, Proceedings of the Joint Ontology Workshops (JOWO) - Episode X: The Tukker Zomer of Ontology, and satellite events co-located with the 14th International Conference on Formal Ontology in Information Systems (FOIS 2024), Enschede, The Netherlands, July 15-19, 2024. Vol 3882, https://ceur-ws.org/Vol-3882/

Diffing
type: Concept
definition: Diffing is the process of comparing two sets of data to identify differences between them.
in scheme: Environmental Research Infrastructure
broader: Terminology Service
modified: 2025-03-21T08:16:20
created: 2025-03-19T13:25:42

ESFRI Research Infrastructure
type: Concept
definition: Research infrastructures that are recognized by the European Strategy Forum on Research Infrastructures (ESFRI) as being of strategic importance for Europe.
in scheme: Environmental Research Infrastructure
broader: Research Infrastructure
modified: 2025-03-20T14:24:27
created: 2025-03-19T13:57:06

ESFRI Landmark
type: Concept
definition: The ESFRI Landmarks are the RIs that were implemented or started implementation under the ESFRI Roadmap and are now established as major elements of competitiveness of the European Research Area. The ESFRI Landmarks need continuous support for successful completion, operation and upgrade in line with the optimal management and maximum return on investment.
in scheme: Environmental Research Infrastructure
broader: ESFRI Research Infrastructure
modified: 2025-03-19T14:10:26
created: 2025-03-19T13:57:29
source: https://www.esfri.eu/glossary

ESFRI Project
type: Concept
definition: The ESFRI Projects have been selected for scientific excellence and maturity and are included in the Roadmap in order to underline their strategic importance for the European Research Infrastructure system and support their timely implementation. The ESFRI Projects can be at different stages of their preparation according to the date of inclusion in the ESFRI Roadmap.
in scheme: Environmental Research Infrastructure
broader: ESFRI Research Infrastructure
modified: 2025-03-19T14:11:18
created: 2025-03-19T13:57:39
source: https://www.esfri.eu/glossary

ACTRIS ERIC
type: Concept
definition: ACTRIS is the pan-European research infrastructure producing high-quality data and information on short-lived atmospheric constituents and on the processes leading to the variability of these constituents in natural and controlled atmospheres.
in scheme: Environmental Research Infrastructure
alternative label: ACTRIS
alternative label: Aerosol, Clouds, and Trace gases Research InfraStructure
broader: ITINERIS Research Infrastructure
related: Environment
related: ESFRI Landmark
modified: 2025-06-19T10:16:43
created: 2025-03-19T14:18:40
source: https://www.actris.eu/

ITINERIS Research Infrastructure
type: Concept
definition: Research Infrastructure involved in the ITINERIS project.
in scheme: Environmental Research Infrastructure
broader: Research Infrastructure
modified: 2025-06-20T08:59:38
created: 2025-06-10T13:49:06

AnaEE-ERIC
type: Concept
definition: The Analysis and Experimentation on Ecosystems (AnaEE) is an European Research Infrastructure Consortium which provides integrated and coordinated management of experimental, analytical and modelling facilities, with the aim to support scientists in testing the potential impacts of climate change and land use in Europe.
in scheme: Environmental Research Infrastructure
alternative label: AnaEE
alternative label: Analysis and Experimentation on Ecosystems
broader: ITINERIS Research Infrastructure
related: Health and Food
related: ESFRI Landmark
modified: 2025-06-19T10:18:17
created: 2025-03-19T14:18:56
source: https://www.anaee.eu/

EMSO ERIC
type: Concept
definition: The European Multidisciplinary Seafloor and water-column Observatory (EMSO) is an European Research Infrastructure Consortium aiming at exploring the oceans to gain a better understanding of phenomena happening within and below them, and to explain the critical role that these phenomena play in the broader Earth system. EMSO offers high-quality environmental data and services covering a multi- and inter-disciplinary range of research areas including biology, geology, chemistry, physics, engineering and computer science, from polar to tropical environments.
in scheme: Environmental Research Infrastructure
alternative label: EMSO
alternative label: European Multidisciplinary Seafloor and water column Observatory
broader: ITINERIS Research Infrastructure
related: Environment
related: ESFRI Landmark
modified: 2025-06-19T10:26:03
created: 2025-03-19T14:19:04
source: https://emso.eu/

EURO-ARGO ERIC
type: Concept
definition: The European contribution to the International Argo Programme (EURO-ARGO) is an European Research Infrastructure Consortium that organizes and federates the European contribution to the Argo international programme for in situ ocean observations. EURO-ARGO provides enhanced coverage in the European regional seas by deploying and operating an array of around 800 floats corresponding to ¼ of the global Argo array of profiling floats which measure temperature and salinity every 10 days throughout the deep global oceans. It delivers data both in real-time and delayed mode for climate change research and monitoring as well as operational services such as Copernicus. It also aims at developing the new phase of Argo extending the network to abyssal oceans, biogeochemical parameters, marginal seas and high latitudes.
in scheme: Environmental Research Infrastructure
alternative label: EURO-ARGO
alternative label: European contribution to the International Argo Programme
broader: ITINERIS Research Infrastructure
related: Environment
related: ESFRI Landmark
modified: 2025-06-19T10:27:45
created: 2025-03-19T14:19:16
source: https://www.euro-argo.eu/

ICOS ERIC
type: Concept
definition: The Integrated Carbon Observation System (ICOS) is an European Research Infrastructure Consortium to facilitate research on carbon cycle and to provide necessary information on greenhouse gases (GHG). ICOS conducts long-term observations in the atmosphere, ecosystems, and oceans, and generates high-precision and stardardised data to monitor the present state and extrapolate the future behaviour of the global carbon cycle and GHG fluxes in order to predict environment changes and mitigate their impacts.
in scheme: Environmental Research Infrastructure
alternative label: ICOS
alternative label: Integrated Carbon Observation System
broader: ITINERIS Research Infrastructure
related: Environment
related: ESFRI Landmark
modified: 2025-06-19T10:48:33
created: 2025-03-19T14:19:22
source: https://www.icos-cp.eu/

LifeWatch ERIC
type: Concept
definition: The e-Infrastructure for Biodiversity and Ecosystem Research (LifeWatch) is an European Research Infrastructure Consortium providing e-Science facilities and services to the biodiversity and ecosystem research community. LifeWatch ERIC seeks to understand the complex interactions between species and the environment, taking advantage of High-Performance, Grid and Big Data computing systems, and the development of advanced modelling tools to implement measures aimed at preserving life on Earth. LifeWatch tackles the constraints affecting biodiversity and ecosystem research, such as the pressing need for increasingly diverse data, larger and more advanced models, open data and open science clouds, thus allowing to explore new frontiers in ecological science and support society in addressing global challenges.
in scheme: Environmental Research Infrastructure
alternative label: LifeWatch
alternative label: e-Infrastructure for Biodiversity and Ecosystem Research
broader: ITINERIS Research Infrastructure
related: Environment
related: ESFRI Landmark
modified: 2025-06-19T10:48:57
created: 2025-03-19T14:19:36
source: https://www.lifewatch.eu

LifeWatch Italy
type: Concept
definition: LifeWatch Italy is the Italian component of the LifeWatch European Research Infrastructure Consortium. The LifeWatch Italy Joint Research Unit (JRU) coordinates the Italian contribution to LifeWatch ERIC, the national activities of its Service Centre and the National Distributed Biodiversity Research Institutes of the infrastructure. These include the activities of specific Working Groups responsible for ICT, Modelling, Citizen Science and specific case studies.
in scheme: Environmental Research Infrastructure
broader: LifeWatch ERIC
modified: 2025-06-18T12:20:12
created: 2025-03-19T14:20:32
source: https://www.lifewatchitaly.eu

ICOS Italy
type: Concept
definition: The ICOS Italy network consists of 17 stations, of which ten are Ecosystem, four Ocean and three Atmosphere stations. ICOS Italy also hosts the Ecosystem Thematic Centre (ETC) together with ICOS Belgium and ICOS France. ICOS Italy Ecosystem stations cover the most typical land types in Italy: different type of forests, grasslands, croplands and shrublands. Atmosphere stations are located in northern Italy, e.g. at the Alps, and at the island of Lampedusa in the Mediterranean Sea. Ocean stations are located at the Adriatic Sea and at the Ligurian Sea.
in scheme: Environmental Research Infrastructure
broader: ICOS ERIC
modified: 2025-03-20T16:35:27
created: 2025-03-19T14:35:16
source: https://www.icos-cp.eu/observations/national-networks/italy

Argo-Italy
type: Concept
definition: Argo-Italy is the Italian component of a global in situ observing system based on measurements with autonomous profiling floats. It focuses mainly on the Italian seas, such as the Mediterranean and the Black Sea being an important component related to it. OGS coordinates and is responsible for the activity of the Mediterranean and Black Sea Argo Regional Center (MedArgo). The activity of Argo-Italy also extends over the Southern Ocean and the Ross Sea. The Argo-Italy funded activity ultimately provides physical (temperature, salinity) and biogeochemical (oxygen, chlorophyll, nitrates, sulfides, etc.) properties of seawater vertical profiles. It contributes to the international Argo and Euro-Argo programs to monitor the entire World Ocean on a long term basis.
in scheme: Environmental Research Infrastructure
broader: EURO-ARGO ERIC
modified: 2025-03-20T16:28:27
created: 2025-03-19T14:35:32
source: https://argo.ogs.it/#/

EMSO Italy
type: Concept
definition: EMSO Italy is the Italian component of the EMSO European Research Infrastructure Consortium. The Ministry of Education, University and Research (MIUR) appointed INGV to represent the Italian scientific community of marine science in EMSO distributed over different Italian Research Institutions.
in scheme: Environmental Research Infrastructure
broader: EMSO ERIC
modified: 2025-06-18T12:10:22
created: 2025-03-19T14:35:40

AnaEE Italy
type: Concept
definition: AnaEE Italy is the Italian component of the AnaEE European Research Infrastructure Consortium. The AnaEE Service Centre in Italy is responsible for data and modelling services.
in scheme: Environmental Research Infrastructure
broader: AnaEE-ERIC
modified: 2025-06-18T11:53:40
created: 2025-03-19T14:35:51

ACTRIS Italy
type: Concept
definition: ACTRIS Italy is the Italian component of the ACTRIS European Research Infrastructure Consortium.
in scheme: Environmental Research Infrastructure
alternative label: ACTRIS-IT
broader: ACTRIS ERIC
modified: 2025-03-20T15:17:17
created: 2025-03-19T14:36:18
source: https://actris.it

DANUBIUS-RI
type: Concept
definition: The International Centre for Advanced Studies on River-Sea Systems (DANUBIUS-RI) is a Research Infrastructure to enable excellent interdisciplinary research and innovation on River-Sea Systems (RSS). Building on existing expertise spanning the environmental, social and economic sciences, it aims to provide an integrated Research Infrastructure for remote and in situ observation systems, experimental facilities, laboratories, modelling tools and resources for knowledge exchange along freshwater-seawater continua throughout Europe, from river source to coastal sea.
in scheme: Environmental Research Infrastructure
alternative label: The International Centre for Advanced Studies on River-Sea Systems
alternative label: DANUBIUS
broader: ITINERIS Research Infrastructure
related: Environment
related: ESFRI Project
modified: 2025-06-19T10:24:31
created: 2025-03-20T11:15:44
source: http://www.danubius-ri.eu/

DiSSCo
type: Concept
definition: The Distributed System of Scientific Collections (DiSSCo) is a Research Infrastructure to integrate European Natural Science Collections (NSCs) for data-intensive research and innovation in environment, food security, health, and bioeconomy. The DiSSCo RI aims to digitally unifies all European natural science assets under common access, curation, policies and practices that ensure that all the data is easily Findable, Accessible, Interoperable and Reusable (FAIR principles). By mobilising, harmonising and providing Natural Science Collections data, DiSSCo fills a significant gap in the value chain of European RIs because it provides a fundamental basis of knowledge at the scale and precision required to enable research for tackling grand societal challenges.
in scheme: Environmental Research Infrastructure
alternative label: Distributed System of Scientific Collections
broader: ITINERIS Research Infrastructure
related: Environment
related: ESFRI Project
modified: 2025-06-19T10:24:40
created: 2025-03-20T11:15:54
source: https://www.dissco.eu/

eLTER-RI
type: Concept
definition: The Integrated European Long-Term Ecosystem, critical zone and socio-ecological system Research Infrastructure (eLTER RI) facilitates high impact research and catalyse new insights about the compounded impacts of climate change, biodiversity loss, soil degradation, pollution, and unsustainable resource use on a range of European socio-ecological systems. eLTER RI aspires to develop the scientific capacity to improve the understanding of terrestrial, freshwater, and transitional water ecosystems. Combined with socio-ecological approach to studying integrated human-nature systems and commitment to integrating stakeholder knowledge, it provides a solid foundation to inform policy-maker systems to find evidence based sustainable solutions for addressing current and emerging challenges.
in scheme: Environmental Research Infrastructure
alternative label: Integrated European Long-Term Ecosystem, critical zone and socio-ecological Research Infrastructure
alternative label: eLTER
broader: ITINERIS Research Infrastructure
related: Environment
related: ESFRI Project
modified: 2025-06-19T10:25:08
created: 2025-03-20T11:16:05
source: https://www.elter-ri.eu/

EMPHASIS
type: Concept
definition: The European Infrastructure for Multi-scale Plant Phenomics and Simulation (EMPHASIS) is a Research Infrastructure with the aim to develop and provide access to facilities and services addressing multi-scale plant phenotyping in different agro-climatic scenarios. It establishes an integrated European phenotyping infrastructure to analyse genotype performance under diverse environmental conditions and quantify the diversity of traits contributing to performance in diverse environmental conditions − plant architecture, major physiological functions and output, yield components and quality. EMPHASIS addresses the technological and organizational limits of European phenotyping, for a full exploitation of genetic and genomic resources available for crop improvement in changing climate.
in scheme: Environmental Research Infrastructure
alternative label: European Infrastructure for Multi-scale Plant Phenomics and Simulation
broader: ITINERIS Research Infrastructure
related: Health and Food
related: ESFRI Project
modified: 2025-06-19T10:25:52
created: 2025-03-20T11:16:13
source: https://emphasis.plant-phenotyping.eu/

EU-IBISBA
type: Concept
definition: The European Industrial Biotechnology Innovation and Synthetic Biology Accelerator (EU-IBISBA) provides translational Research and Development and Innovation services to an international community of industrial biotechnology stakeholders, including academia, SMEs and industry. EU-IBISBA contributes to the growth of biotechnology, providing academics and industry with a unique opportunity to access services and expertise necessary to move early-stage research results towards higher maturity and innovation. It delivers services at the exit point of basic and early stage applied research, and provides support for concept proofing, prototyping, upscaling and piloting, to bridge the innovation gap that separates academic research from industrial demonstration and premarket development.
in scheme: Environmental Research Infrastructure
alternative label: IBISBA
alternative label: European Industrial Biotechnology Innovation and Synthetic Biology Accelerator
broader: ITINERIS Research Infrastructure
related: Health and Food
related: ESFRI Project
modified: 2025-07-15T16:24:16
created: 2025-03-20T11:16:19
source: http://www.ibisba.eu/

CeTrA
type: Concept
definition: The Centre for Trace Analysis (CeTrA) is a joint infrastructure of Ca’ Foscari University of Venice and the Institute for Polar Sciences of the Italian National Research Council (ISP-CNR). CeTrA is interested in trace/ultra-trace analysis and chemical imaging in the fields of life science, environment, advanced materials and cultural heritage. CeTrA facilities make available state-of-the art instrumentation and technical expertise for advanced studies of chemical identification and quantitative determination at extremely low levels and/or in complex matrices, and spatial distribution or structural analyses at the micro-to-nano scale.
in scheme: Environmental Research Infrastructure
alternative label: Centre for Trace Analysis
broader: ITINERIS Research Infrastructure
related: Environment
modified: 2025-06-19T10:22:28
created: 2025-03-20T14:57:48
source: https://www.unive.it/pag/42456

GeoSciences IR
type: Concept
definition: The GeoSciences IR aims at sharing and updating geological knowledge of the Italian territory and to enhance collaboration and information exchange with national and regional technical entities dealing with geology.
in scheme: Environmental Research Infrastructure
alternative label: GeoSciences
alternative label: A Research Infrastructure for the Italian Geological Surveys Network
broader: ITINERIS Research Infrastructure
related: Physical Sciences and Engineering
modified: 2025-06-19T10:48:22
created: 2025-03-20T14:58:02
source: https://geosciences-ir.it/en/

LNS
type: Concept
definition: The LNS is one of the four national laboratories of the National Institute for Nuclear Physics (INFN). Research activities are mainly oriented towards Nuclear Physics and Nuclear and Particle Astrophysics. The LNS is also an advanced centre for the development of technologies and instrumentation.
in scheme: Environmental Research Infrastructure
alternative label: Laboratori Nazionali del Sud @it
broader: ITINERIS Research Infrastructure
related: Physical Sciences and Engineering
modified: 2025-07-15T15:36:23
created: 2025-03-20T14:58:42
source: https://www.lns.infn.it/en/

R/V Laura Bassi
type: Concept
definition: The research vessel Laura Bassi is the only ocean research vessel owned by a public institute in Italy and the only one available for national research. The R/V Laura Bassi is owned by the National Institute of Oceanography and Experimental Geophysics (OGS) since 2019. This ship is capable of operating in polar regions including Antarctica and the Arctic. The main objective of the R/V Laura Bassi is to provide scientific and logistical support to the Italian polar missions and at the same time to enable oceanographic and geophysical research by the researchers of the institute and the national and European scientific community at a global level and in particular at a polar level.
in scheme: Environmental Research Infrastructure
alternative label: Research Vessel Laura Bassi
broader: Eurofleets
related: Environment
modified: 2025-07-15T15:23:36
created: 2025-03-20T14:58:59
source: https://www.ogs.it/en/research-vessel-laura-bassi

Eurofleets
type: Concept
definition: EUROFLEETS+, funded under the European Horizon2020 Infrastructures initiative and coordinated by the Marine Institute (Ireland), brings together 42 key marine institutes, universities, foundations and SMEs from 24 countries in Europe, North America and Oceania. This infrastructure facilitates open access to an integrated and advanced research vessel fleet and prioritises support for research on sustainable, clean and healthy oceans, linking with existing ocean observation infrastructures (eg. EMSO and ECORD-IODP), and innovation through working closely with industry. It enables access to a unique fleet of 27 state-of-the-art research vessels from European and international partners.
in scheme: Environmental Research Infrastructure
alternative label: An alliance of European marine research infrastructure to meet the evolving needs of the research and industrial communities
broader: ITINERIS Research Infrastructure
related: Environment
modified: 2025-06-19T10:48:09
created: 2025-03-20T15:00:22
source: https://www.eurofleets.eu

ATLaS
type: Concept
definition: The Advanced Technologies for LandSlides (ATLaS) Research Infrastructure develops advanced methodologies for the prevention and management of ground instabilities including outputs from leading-edge monitoring platforms and hazard forecasting models in a multi-scale perspective.
in scheme: Environmental Research Infrastructure
alternative label: Advanced Technologies for LandSlides
broader: ITINERIS Research Infrastructure
related: Environment
modified: 2025-06-19T10:22:05
created: 2025-03-20T14:59:19
source: https://www.ri-atlas.unifi.it/

SMINO
type: Concept
definition: SMINO is an infrastructure of national importance and has the task of surveillance and research on seismic activity in North-eastern Italy, also for Civil Protection purposes. SMINO consists of a seismic network, a strong motion network and a geodetic monitoring network (FReDNet).
in scheme: Environmental Research Infrastructure
alternative label: Northeast Italy monitoring system
broader: ITINERIS Research Infrastructure
related: Environment
modified: 2025-06-19T10:51:17
created: 2025-03-20T14:59:28
source: https://www.ogs.it/en/northeast-italy-monitoring-system-smino

EUFAR
type: Concept
definition: The European Facility for Airborne Research (EUFAR) is a collaborative network dedicated to advancing airborne research in environmental and geosciences across Europe. EUFAR promotes scientific collaboration, supports innovation, and enhances research by providing access to a wide range of airborne platforms and instruments.
in scheme: Environmental Research Infrastructure
alternative label: EUropean Facility for Airborne Research
broader: ITINERIS Research Infrastructure
related: Environment
modified: 2025-06-19T10:27:18
created: 2025-03-20T14:59:54
source: https://www.eufar.net

SIOS
type: Concept
definition: An international observing system for long-term measurements in and around the Norwegian archipelago of Svalbard addressing Earth System Science questions.
in scheme: Environmental Research Infrastructure
alternative label: Svalbard Integrated Arctic Earth Observing System
broader: ITINERIS Research Infrastructure
related: Environment
modified: 2025-06-19T10:50:55
created: 2025-03-20T14:59:59
source: https://sios-svalbard.org

JERICO-RI
type: Concept
definition: JERICO-RI is an integrated pan-European multidisciplinary and multi-platform research infrastructure dedicated to a holistic appraisal of coastal marine system changes.
in scheme: Environmental Research Infrastructure
alternative label: Joint pan-European Research Infrastructure for Coastal Observations
broader: ITINERIS Research Infrastructure
related: Environment
modified: 2025-06-19T10:48:48
created: 2025-03-20T15:00:36
source: https://www.jerico-ri.eu

ECORD
type: Concept
definition: The European Consortium for Ocean Research Drilling (ECORD), is a management structure of 15 members (14 European countries and Canada) for scientific ocean drilling as part of the International Ocean Discovery Program (IODP) “Exploring the Earth under the sea” and previously the Integrated Ocean Drilling Program – IODP from 2003 to 2013. The science in IODP involves a wide range of fundamental and applied issues for society, such as climate and ocean change, biodiversity and origin of life, the Earth in motion including the study of earthquakes processes, and the Earth structure and dynamics in relation with its surface environment.
in scheme: Environmental Research Infrastructure
alternative label: European Consortium for Ocean Research Drilling
broader: ITINERIS Research Infrastructure
related: Environment
modified: 2025-06-19T10:24:54
created: 2025-03-20T15:00:50
source: https://www.ecord.org

DANUBIUS Italy
type: Concept
definition: DANUBIUS Italy is coordinated by the Institute for Marine Science (ISMAR) of the National Research Council (CNR). Within DANUBIUS-RI, DANUBIUS Italy is the leading laboratory of the Modelling Node, one of the four Thematic Nodes of the RI. The Italian node performs integrated in-situ, satellite and modelling data, providing services related to Tools 4 MSP, Models codes, and training material.
in scheme: Environmental Research Infrastructure
broader: DANUBIUS-RI
modified: 2025-03-20T17:06:34
created: 2025-03-20T16:57:01

DiSSCo Italy
type: Concept
definition: The Italian node of DiSSCo Research Infrastructure provides digital data on the collections of natural science institutions in Italy. In DiSSCo, the Italian scientific community is represented by CNR (National Research Council), ANMS (National Association of Scientific Museums), Academy of Sciences, National Academy of Entomology, Italian Society of Biogeography, Italian Society of Paleontology, Italian Society of Geology, Italian Botanic Society and the Natural History Museum of Florence University, the leading NTF representative.
in scheme: Environmental Research Infrastructure
broader: DiSSCo
modified: 2025-07-15T16:10:16
created: 2025-03-21T11:40:26
source: https://www.dissco.eu/it/

eLTER-IT
type: Concept
definition: LTER-Italy is one of the 26 long-term ecological research networks that belong to the European Network (eLTER). LTER-Italy Network is made of 72 research sites, spread all over the Italian territory. The research sites represent a variety of environments: land, freshwater, marine water, and transitional. Other than the 72 sites on the national territory, the Italian Network also counts 7 extraterritorial sites located in the Himalayan region and Antarctica. LTER-Italy research sites are open windows to observe local territories, and they hold important long-term series of data. In these sites researchers can collaborate, future ecologists can be trained, and the citizens can be actively involved.
in scheme: Environmental Research Infrastructure
alternative label: LTER-Italy
alternative label: Italian Long-Term Ecosystem Research Network
broader: eLTER-RI
modified: 2025-06-05T16:22:20
created: 2025-03-21T11:49:29
source: https://www.lteritalia.it/

Phen-Italy
type: Concept
definition: The Joint Research Unit (JRU) denominated Italian Plant Phenotyping Network (Phen-Italy) was established in 2016 and is composed of several universities and research entities which represent the national node of the ESFRI Project EMPHASIS.
in scheme: Environmental Research Infrastructure
alternative label: The Italian Plant Phenotyping Network
broader: EMPHASIS
modified: 2025-03-21T12:05:35
created: 2025-03-21T12:00:04
source: https://www.phen-italy.it/

IBISBA-IT
type: Concept
definition: IBISBA-IT serves as the Italian Node of the European Research Infrastructure IBISBA, playing a distinct role across four key domains: Synthetic Biology, Green Chemistry, Sustainable Bioenergy, and Functional Food. IBISBA-IT contributes to the overarching goals of IBISBA by bolstering the Italian scientific research in Industrial Biotechnology, supporting national and local authorities, and fostering training and educational initiatives.
in scheme: Environmental Research Infrastructure
broader: EU-IBISBA
modified: 2025-06-18T12:15:54
created: 2025-03-21T12:09:51
source: https://ibisba.it

IODP-Italy
type: Concept
definition: Italy participates in the International Ocean Discovery Program (IODP) as a member country of the European Consortium for Ocean Research Drilling (ECORD). The Italian contribution to ECORD IODP (International Ocean Discovery Program) and ICDP (International Continental Scientific Drilling Program) is supported by the National Research Council (CNR) ECORD-IODP and ICDP Commission, which is dedicated to scientific and programmatic coordination and the promotion of activities to support research, training and dissemination in the field of scientific drilling. In particular, IODP-Italy is linked to its membership of the ECORD consortium, made possible by a dedicated MIUR grant, managed by the CNR since 2014.
in scheme: Environmental Research Infrastructure
broader: ECORD
modified: 2025-03-21T12:42:23
created: 2025-03-21T12:35:28
source: https://www.iodp-italia.cnr.it/

c 8f8bc507
definition: Use of quality data and data products and other digital services including data documentation, compilation, archiving, preservation, traceability, citation and attribution.
modified: 2025-06-05T15:40:23

Scientific service
type: Concept
definition: Use of experimental research facilities equipped with state-of-art instrumentation and equipment for scientific exporation and realisation of experiments.
in scheme: Environmental Research Infrastructure
broader: Service
modified: 2025-07-15T14:26:47
created: 2025-03-27T12:57:17

Technical service
type: Concept
definition: Use of the scientific expertise centres to ensure instrumental quality, high performance measurments and methodologies, calibration and intercomparisons, quality procedures and tools.
in scheme: Environmental Research Infrastructure
broader: Service
modified: 2025-07-15T14:26:59
created: 2025-03-27T13:51:15

Innovation service
type: Concept
definition: Use of scientific facilities for technological development, prototype testing, industrial or market-oriented applications including private sector use.
in scheme: Environmental Research Infrastructure
broader: Service
modified: 2025-07-15T14:12:48
created: 2025-03-27T13:53:26

Training service
type: Concept
definition: Training of scientists, new generations of researchers, and facility personnel to acquire knowledge and skills and provided good to exploit all essential tools for science.
in scheme: Environmental Research Infrastructure
broader: Service
broad match: concept84
modified: 2025-07-15T14:14:00
created: 2025-03-27T13:55:43

Crosswalk
type: Concept
definition: A specification consisting of a set of rules that define how (meta)data elements or attributes from one schema can be aligned and mapped to (meta)data elements or attributes in another schema that share the same constraints and thus share the same semantic role.
in scheme: Environmental Research Infrastructure
broader: Terminology Service
modified: 2025-04-15T12:11:17
created: 2025-04-15T12:10:58

Stakeholder
type: Concept
definition: Stakeholders are individuals or groups who have an interest in the project and who may be affected by its outcomes—positively or negatively. This includes not only those directly involved in the execution of the project but also those who are indirectly impacted by its results.
in scheme: Environmental Research Infrastructure
broader: Actor
modified: 2025-06-13T10:49:05
created: 2025-06-05T16:02:03
source: https://instituteprojectmanagement.com/blog/what-are-stakeholders-understanding-their-importance/

Observatory
type: Concept
definition: A building or place given over to or equipped for observation of natural phenomena.
in scheme: Environmental Research Infrastructure
broader: Facility
modified: 2025-06-06T15:47:09
modified: 2025-06-06T15:50:58
created: 2025-06-06T09:36:24
source: https://www.merriam-webster.com/dictionary/observatory

Research site
type: Concept
definition: An in-situ observation or experimentation facility, delimited in space, but varying in size and complexity of the internal organisational and observational design, for the collection of data covering e.g., biogeophysical, biotic or socio-ecological characteristics and processes.
in scheme: Environmental Research Infrastructure
broader: Facility
modified: 2025-06-06T16:02:29
modified: 2025-06-06T16:04:06
created: 2025-06-06T09:36:37
source: https://doi.org/10.1016/j.ecoinf.2019.01.005

Platform
type: Concept
definition: A Platform is a facility that hosts other facilities (e.g. devices, research sites).
in scheme: Environmental Research Infrastructure
broader: Facility
narrow match: observationplatform-fixed
narrow match: observationplatform-mobile
modified: 2025-06-06T15:55:09
created: 2025-06-06T09:36:49

CARE Principles
type: Concept
definition: The CARE Principles for Indigenous Data Governance emphasize that data must be used in ways that support Collective Benefit, recognize Authority to Control, show Responsibility, and uphold Ethics. These principles address the contextual and cultural dimensions of data governance, particularly the rights and interests of Indigenous Peoples in relation to their data. CARE is centered on people and purpose, ensuring that data governance respects Indigenous sovereignty, values, and knowledge systems.
in scheme: Environmental Research Infrastructure
broader: Best practice
modified: 2025-06-10T10:26:08
created: 2025-06-06T09:39:53
source: https://doi.org/10.5334/dsj-2020-043

TRUST Principles
type: Concept
definition: The TRUST Principles—Transparency, Responsibility, User focus, Sustainability, and Technology—provide a set of high-level ethical and operational guidelines designed to ensure transparency, accountability, and responsible behavior in the management and use of data, digital systems, or partnerships. These principles often include values such as integrity, fairness, privacy, and inclusiveness to foster trust among stakeholders.
in scheme: Environmental Research Infrastructure
broader: Best practice
modified: 2025-06-10T10:41:42
created: 2025-06-06T09:40:20
source: https://doi.org/10.1038/s41597-020-0486-7

Long-term sustainability
type: Concept
definition: The long-term maintenance of responsibility, which has environmental, economic, and social dimensions, and encompasses the concept of stewardship, the responsible management of resource use.
in scheme: Environmental Research Infrastructure
alternative label: Sustainability
broader: Research product management
modified: 2025-06-24T10:48:07
created: 2025-06-06T09:44:07

Funder
type: Concept
definition: A person or organization that supports (sponsors) something through some kind of financial contribution.
in scheme: Environmental Research Infrastructure
broader: Stakeholder
modified: 2025-06-18T09:45:04
created: 2025-06-06T09:52:32

Access unit
type: Concept
definition: The access unit is a measure specifying the Access offered to the users so that quantity of access can be recorded.
in scheme: Environmental Research Infrastructure
broader: Access
modified: 2025-06-18T10:49:47
created: 2025-06-06T11:26:17
source: https://doi.org/10.2777/8299402

Workflow
type: Concept
definition: The process that is used to produce a specific research result in a concrete domain. A workflow comprises a series of components that are arranged in a directed graph to set the order of execution of such components. Therefore, a workflow is usually a complex process and may involve both automatic and manual procedures for dealing with research objects and documenting them. Workflows may need instantiation in terms of input data and process parameters.
in scheme: Environmental Research Infrastructure
broader: Digital Object
modified: 2025-06-06T15:10:29
created: 2025-06-06T11:28:43

Training resource
type: Concept
definition: Training resource is defined as any material, tool, support, or content specifically designed to facilitate the process of learning and skill development. These resources are utilised across a variety of contexts, including formal education, professional development and technical training.
in scheme: Environmental Research Infrastructure
broader: Digital Object
modified: 2025-06-11T10:41:34
created: 2025-06-06T11:29:42

Sampler
type: Concept
definition: A device that is used by, or implements, a (Sampling) Procedure to create or transform one or more samples.
in scheme: Environmental Research Infrastructure
broader: Device
modified: 2025-06-18T14:38:25
created: 2025-06-06T15:07:22

Sensor
type: Concept
definition: Device, agent (including humans), or software (simulation) involved in, or implementing, a Procedure. Sensors respond to a Stimulus, e.g., a change in the environment, or Input data composed from the Results of prior Observations, and generate a Result. Sensors can be hosted by Platforms.
in scheme: Environmental Research Infrastructure
broader: Device
modified: 2025-06-18T15:23:25
created: 2025-06-06T15:16:51

Citizen
type: Concept
definition: Legally recognised person who is affiliated to an area, usually a state or a territory, and who is entitled to certain protection, rights and privileges and subject to certain obligations.
in scheme: Environmental Research Infrastructure
broader: Stakeholder
modified: 2025-07-15T16:12:32
created: 2025-06-10T13:35:51

Public sector
type: Concept
definition: Segment of the economy run to some degree by government, including national and local governments, government-owned firms and quasi-autonomous non-government organizations.
in scheme: Environmental Research Infrastructure
alternative label: Public administration
alternative label: Public body
broader: Partner
broader: Stakeholder
modified: 2025-06-19T10:06:39
created: 2025-06-10T13:36:10

Policy maker
type: Concept
definition: One involved in the formulation of policies, especially politicians, lobbyists, and activists.
in scheme: Environmental Research Infrastructure
alternative label: Policymaker
alternative label: Policy-maker
broader: Stakeholder
modified: 2025-06-18T09:32:15
created: 2025-06-10T13:36:43
source: https://en.wiktionary.org/wiki/policymaker

Digital Specimen
type: Concept
definition: Digital Specimen (DS) refers to a digital representation of a physical specimen that links it with all related data, metadata, and artifacts. It enables reliable discovery, access, attribution, and reuse of specimen information. DS also support traceability of usage and facilitate the fair return of benefits from scientific discoveries, such as repatriation to the country of origin.
in scheme: Environmental Research Infrastructure
alternative label: DS
broader: Digital Object
modified: 2025-06-11T10:52:31
created: 2025-06-11T10:44:34
source: https://dissco.tech/2020/03/31/what-is-a-digital-specimen/

Data level
type: Concept
definition: Data level refers to the degree of processing, quality control, and readiness for use of data, describing how raw data are transformed into usable and validated data products. Users can access different data levels depending on their needs.
in scheme: Environmental Research Infrastructure
broader: Data product
modified: 2025-06-24T11:22:30
created: 2025-06-12T10:34:45
source: https://www.icos-otc.org/data-levels-quality-access

Free
type: Concept
definition: Users can freely access the Resource provided, registration may be needed.
in scheme: Environmental Research Infrastructure
broader: Access condition
modified: 2025-06-20T09:33:03
created: 2025-06-17T10:13:28
source: https://github.com/EOSC-PLATFORM/service-profile/blob/main/docs/_vocabularies/ACCESS_MODE.rst

Free conditionally
type: Concept
definition: Users are granted access based on defined policies; such policies usually apply to Resources being offered with “sponsored use” to meet some national or EU level objective; for instance, a country may offer Resources with “sponsored use” to support national researchers involved in international collaborations.
in scheme: Environmental Research Infrastructure
broader: Access condition
modified: 2025-06-20T09:33:44
created: 2025-06-17T10:14:04
source: https://github.com/EOSC-PLATFORM/service-profile/blob/main/docs/_vocabularies/ACCESS_MODE.rst

Peer-reviewed
type: Concept
definition: Users are selected based on scientific excellence evaluation, originality, quality and technical and ethical feasibility of an application evaluated through peer review conducted by internal or external experts of the activity to be supported by the Resource.
in scheme: Environmental Research Infrastructure
broader: Access condition
modified: 2025-07-15T16:14:04
created: 2025-06-17T10:14:31
source: https://github.com/EOSC-PLATFORM/service-profile/blob/main/docs/_vocabularies/ACCESS_MODE.rst

Paid
type: Concept
definition: Users need to pay a fee to access the Resource.
in scheme: Environmental Research Infrastructure
broader: Access condition
modified: 2025-07-15T16:14:19
created: 2025-06-17T10:14:58
source: https://github.com/EOSC-PLATFORM/service-profile/blob/main/docs/_vocabularies/ACCESS_MODE.rst

Distributed Research Infrastructure
type: Concept
definition: A Distributed RI is a coordinated network composed of a Central Hub and interconnected National Nodes, with unified governance, integrated user access, a common investment and resource strategy, and shared user programmes and operational policies to ensure scientific excellence and sustainability.
in scheme: Environmental Research Infrastructure
alternative label: Distributed RI
broader: Research Infrastructure
modified: 2025-06-19T10:25:09
created: 2025-06-17T15:29:02
source: https://www.esfri.eu/glossary

Single Site Research Infrastructure
type: Concept
definition: A Single Site RI is a geographically localised central facility designed for user access, with European or international governance, a structured user programme and access policies, advanced data management systems, and dedicated resources to ensure scientific excellence and sustainability.
in scheme: Environmental Research Infrastructure
alternative label: Single Site RI
broader: Research Infrastructure
modified: 2025-06-19T10:26:03
created: 2025-06-17T15:39:44
source: https://www.esfri.eu/glossary

Private sector
type: Concept
definition: Segment of the economy not run by government, including households, sole traders, partnerships and companies.
in scheme: Environmental Research Infrastructure
broader: Partner
modified: 2025-06-19T10:08:05
created: 2025-06-17T15:57:55

Task
type: Concept
definition: A component of work performed during the course of a project. A task or set of tasks are carried out in order to create an assignable deliverable. Task and activity are sometimes used interchangeably.
in scheme: Environmental Research Infrastructure
alternative label: Activity
broader: Work Package
modified: 2025-07-15T15:25:02
created: 2025-06-17T16:00:54

Federation
type: Concept
definition: Situation in which multiple parties, the federation members, jointly contribute to the delivery of services to users without being organised in a strict hierarchical setup or supply chain.
in scheme: Environmental Research Infrastructure
broader: Service
modified: 2025-06-17T16:44:33
created: 2025-06-17T16:43:14
source: https://wiki.eoscfuture.eu/display/PUBLIC/EOSC+Future+Glossary

Federation member
type: Concept
definition: Individual, organisation or body that works together with other federation members in a federation to provide one or more services.
in scheme: Environmental Research Infrastructure
broader: Federation
modified: 2025-06-17T16:45:25
created: 2025-06-17T16:44:59

Service component
type: Concept
definition: Logical part of a service that provides a function enabling or enhancing a service. A service is usually composed of several service components. Although a service component underlies one or more services, it usually does not create value for a user alone and is therefore not a service by itself.
in scheme: Environmental Research Infrastructure
broader: Service
modified: 2025-06-17T16:48:55
created: 2025-06-17T16:47:14
source: https://wiki.eoscfuture.eu/display/PUBLIC/EOSC+Future+Glossary

Physical object
type: Concept
definition: An independent continuant that is spatially extended whose identity is independent of that of other entities and can be maintained through time.
in scheme: Environmental Research Infrastructure
alternative label: Material entity
broader: Research product
modified: 2025-06-19T10:33:23
created: 2025-06-17T16:50:57

Physical specimen
definition: A material entity that is collected for potential use as an input upon which measurements or observations are performed.
modified: 2025-06-17T17:00:46
modified: 2025-06-17T17:03:57

Specimen collection
modified: 2025-06-17T17:05:08

User
type: Concept
definition: The individuals or groups who are the intended consumers of a resource.
in scheme: Environmental Research Infrastructure
broader: Stakeholder
modified: 2025-06-18T09:40:50
created: 2025-06-18T09:33:27

Specimen
type: Concept
definition: A material entity that is collected for potential use as an input upon which measurements or observations are performed.
in scheme: Environmental Research Infrastructure
broader: Physical object
modified: 2025-06-19T10:36:18
created: 2025-06-18T11:29:50

Collection
type: Concept
definition: A pool of specimens is a mixture of a population of samples which have been gathered from one or more sample populations, obtained by the physical process of mixing individual specimens, e.g. mixing the DNA collected from the individual fish.
in scheme: Environmental Research Infrastructure
alternative label: Pool of specimen
broader: Physical object
modified: 2025-06-19T10:38:24
created: 2025-06-18T11:30:00

Publication
type: Concept
definition: Peer-reviewed research that is usually published in a journal or book.
in scheme: Environmental Research Infrastructure
broader: Digital Object
modified: 2025-06-19T11:35:32
created: 2025-06-19T11:35:09

Instrument
type: Concept
definition: Any object or item, electronic or not, which is used in a lab and designed to carry out a specific function or set of functions.
in scheme: Environmental Research Infrastructure
alternative label: Laboratory instrument
broader: Device
modified: 2025-07-15T16:15:18
created: 2025-06-24T10:14:29

Priority-driven access
type: Concept
definition: In priority-driven Access condition, the Research Infrastructure selects User proposals considering their relevance for addressing a predefined priority. This includes urgent or customized Access to respond to: a scientific or societal challenge (challenge-driven); a crisis; education and training (need-driven). By providing Access to education and training, Research Infrastructures fulfill their role in enhancing the skills of the next generations of scientists and innovators.
in scheme: Environmental Research Infrastructure
broader: Access condition
modified: 2025-07-15T14:51:27
created: 2025-07-15T14:48:59
source: https://doi.org/10.2777/8299402